{"text_format":"1","workbook":"xlsx","n_sheets":6,"sheets":["AOM-802","Plantilla","Referencias Normativas","Matriz de Conciliación","Poliductos","ESRI_MAPINFO_SHEET"],"not_rendered":{"charts":0,"images":0,"macros":1,"external_links":0,"defined_names":5,"comments":1,"pivot_tables":0},"unopened":[],"bounds":{"document_bytes":16777216,"sheet_cells":100000,"rows_first":2000,"rows_last":500,"rows_between":2000,"halvings":0,"cell_chars":16384,"cell_head_chars":4096},"cells_cut":0,"cells_raw":0,"read":"whole","date_system":"1900"}

{"sheet":"AOM-802","index":0,"n_rows":2228,"n_cols":4,"rows_kept":2228,"cut":false,"hidden":true,"merged":[]}
["CODIGO POLIDUCTO","CODIGO_CONCEPTO","CODIGO_EDC","VALOR"]
[{"$f":"VLOOKUP(Plantilla!$A$2,Poliductos!#REF!,2,0)","v":{"$error":"#REF!"}},"01000000","ATCLXP",{"$f":"Plantilla!D4","v":0}]
[{"$f":"VLOOKUP(Plantilla!$A$2,Poliductos!#REF!,2,0)","v":{"$error":"#REF!"}},"01010000","ATCLXP",{"$f":"Plantilla!D5","v":0}]
[{"$f":"VLOOKUP(Plantilla!$A$2,Poliductos!#REF!,2,0)","v":{"$error":"#REF!"}},"01010100","ATCLXP",{"$f":"Plantilla!D6","v":0}]
[{"$f":"VLOOKUP(Plantilla!$A$2,Poliductos!#REF!,2,0)","v":{"$error":"#REF!"}},"01010200","ATCLXP",{"$f":"Plantilla!D7","v":0}]
[{"$f":"VLOOKUP(Plantilla!$A$2,Poliductos!#REF!,2,0)","v":{"$error":"#REF!"}},"01010201","ATCLXP",{"$f":"Plantilla!D8","v":0}]
[{"$f":"VLOOKUP(Plantilla!$A$2,Poliductos!#REF!,2,0)","v":{"$error":"#REF!"}},"01010202","ATCLXP",{"$f":"Plantilla!D9","v":0}]
[{"$f":"VLOOKUP(Plantilla!$A$2,Poliductos!#REF!,2,0)","v":{"$error":"#REF!"}},"01010300","ATCLXP",{"$f":"Plantilla!D10","v":0}]
[{"$f":"VLOOKUP(Plantilla!$A$2,Poliductos!#REF!,2,0)","v":{"$error":"#REF!"}},"01010301","ATCLXP",{"$f":"Plantilla!D11","v":0}]
[{"$f":"VLOOKUP(Plantilla!$A$2,Poliductos!#REF!,2,0)","v":{"$error":"#REF!"}},"01010302","ATCLXP",{"$f":"Plantilla!D12","v":0}]
[{"$f":"VLOOKUP(Plantilla!$A$2,Poliductos!#REF!,2,0)","v":{"$error":"#REF!"}},"01010400","ATCLXP",{"$f":"Plantilla!D13","v":0}]
[{"$f":"VLOOKUP(Plantilla!$A$2,Poliductos!#REF!,2,0)","v":{"$error":"#REF!"}},"01010500","ATCLXP",{"$f":"Plantilla!D14","v":0}]
[{"$f":"VLOOKUP(Plantilla!$A$2,Poliductos!#REF!,2,0)","v":{"$error":"#REF!"}},"01010600","ATCLXP",{"$f":"Plantilla!D15","v":0}]
[{"$f":"VLOOKUP(Plantilla!$A$2,Poliductos!#REF!,2,0)","v":{"$error":"#REF!"}},"01010700","ATCLXP",{"$f":"Plantilla!D16","v":0}]
[{"$f":"VLOOKUP(Plantilla!$A$2,Poliductos!#REF!,2,0)","v":{"$error":"#REF!"}},"01010800","ATCLXP",{"$f":"Plantilla!D17","v":0}]
[{"$f":"VLOOKUP(Plantilla!$A$2,Poliductos!#REF!,2,0)","v":{"$error":"#REF!"}},"01010900","ATCLXP",{"$f":"Plantilla!D18","v":0}]
[{"$f":"VLOOKUP(Plantilla!$A$2,Poliductos!#REF!,2,0)","v":{"$error":"#REF!"}},"01011000","ATCLXP",{"$f":"Plantilla!D19","v":0}]
[{"$f":"VLOOKUP(Plantilla!$A$2,Poliductos!#REF!,2,0)","v":{"$error":"#REF!"}},"01020000","ATCLXP",{"$f":"Plantilla!D20","v":0}]
[{"$f":"VLOOKUP(Plantilla!$A$2,Poliductos!#REF!,2,0)","v":{"$error":"#REF!"}},"01020100","ATCLXP",{"$f":"Plantilla!D21","v":0}]
[{"$f":"VLOOKUP(Plantilla!$A$2,Poliductos!#REF!,2,0)","v":{"$error":"#REF!"}},"01020200","ATCLXP",{"$f":"Plantilla!D22","v":0}]
[{"$f":"VLOOKUP(Plantilla!$A$2,Poliductos!#REF!,2,0)","v":{"$error":"#REF!"}},"01020300","ATCLXP",{"$f":"Plantilla!D23","v":0}]
[{"$f":"VLOOKUP(Plantilla!$A$2,Poliductos!#REF!,2,0)","v":{"$error":"#REF!"}},"01020400","ATCLXP",{"$f":"Plantilla!D24","v":0}]
[{"$f":"VLOOKUP(Plantilla!$A$2,Poliductos!#REF!,2,0)","v":{"$error":"#REF!"}},"01020500","ATCLXP",{"$f":"Plantilla!D25","v":0}]
[{"$f":"VLOOKUP(Plantilla!$A$2,Poliductos!#REF!,2,0)","v":{"$error":"#REF!"}},"01020600","ATCLXP",{"$f":"Plantilla!D26","v":0}]
[{"$f":"VLOOKUP(Plantilla!$A$2,Poliductos!#REF!,2,0)","v":{"$error":"#REF!"}},"01020700","ATCLXP",{"$f":"Plantilla!D27","v":0}]
[{"$f":"VLOOKUP(Plantilla!$A$2,Poliductos!#REF!,2,0)","v":{"$error":"#REF!"}},"01030000","ATCLXP",{"$f":"Plantilla!D29","v":0}]
[{"$f":"VLOOKUP(Plantilla!$A$2,Poliductos!#REF!,2,0)","v":{"$error":"#REF!"}},"01030100","ATCLXP",{"$f":"Plantilla!D30","v":0}]
[{"$f":"VLOOKUP(Plantilla!$A$2,Poliductos!#REF!,2,0)","v":{"$error":"#REF!"}},"01030200","ATCLXP",{"$f":"Plantilla!D31","v":0}]
[{"$f":"VLOOKUP(Plantilla!$A$2,Poliductos!#REF!,2,0)","v":{"$error":"#REF!"}},"01030300","ATCLXP",{"$f":"Plantilla!D32","v":0}]
[{"$f":"VLOOKUP(Plantilla!$A$2,Poliductos!#REF!,2,0)","v":{"$error":"#REF!"}},"01030400","ATCLXP",{"$f":"Plantilla!D33","v":0}]
{"$rows_left_out":2199}
{"sheet":"Plantilla","index":1,"n_rows":138,"n_cols":20,"rows_kept":138,"cut":false,"hidden":false,"merged":[[0,19,2,19],[0,0,0,1],[0,2,2,2],[1,0,1,1],[0,3,0,17],[0,18,2,18]]}
["FORMATO AOM-802\nREPORTE DE INFORMACIÓN DE COSTOS PARA LA REGULACIÓN\nTransporte de Combustibles Líquidos",null,"RN","EDC - ESTRUCTURA DE COSTOS - SUBACTIVIDADES",null,null,null,null,null,null,null,null,null,null,null,null,null,null,"TOTAL AOM DE TRANSPORTE DE COMBUSTIBLES LÍQUIDOS","Observaciones"]
["-Seleccione el poliducto a reportar-",null,null,"Asociados al Transporte de Combustibles Líquidos por Poliducto","Asociados al lleno de línea","Por concepto de corridas con raspador inteligente","Por concepto de compresión asociada al sistema de transporte.","Asociados al mantenimiento de estaciones de bombeo","Asociados a puntos de entrada y salida","Asociados a Oleoductos","Asociados a Puertos, Llenaderos, Cargaderos y Descargaderos","Asociados con servicios prestados a terceros -Servicios industriales","Asociados al almacenamiento comercial","Asociados al plan margen de continuidad","Asociados a activos de conexión de otro agente o activos de conexión de usuarios siempre y cuando estos activos no estén en la base de inversión.","Asociados con la reposición de activos","Asociados con los costos de la inversión en infraestructura","Asociados a otras actividades no relacionadas anteriormente"]
["Código Concepto","Descripción concepto CREG",null,"ATCLXP","LLL","CRI","CCT","MAOEB","APES","AOLEO","APLCD","ASPATSI","ALCOM","APMC","ACOANBI","REPAC","CII","OAN"]
["01000000","GASTOS","X",{"$f":"SUM(D5,D20,D29,D41,D42,D43,D51)","v":0},{"$f":"SUM(E5,E20,E29,E41,E42,E43,E51)","v":0},0,0,0,0,0,0,0,0,0,0,0,0,0,{"$f":"SUM(D4:R4)","v":0}]
["01010000","BENEFICIOS A EMPLEADOS","X",{"$f":"SUM(D6,D7,D10,D13:D19)","v":0},{"$f":"SUM(E6,E7,E10,E13:E19)","v":0},0,0,0,0,0,0,0,0,0,0,0,0,0,0]
["01010100","Sueldos y salarios",null,null,null,null,null,null,null,null,null,null,null,null,null,null,null,null,0]
["01010200","Primas y prestaciones sociales",null,{"$f":"SUM(D8:D9)","v":0},{"$f":"SUM(E8:E9)","v":0},0,0,0,0,0,0,0,0,0,0,0,0,0,0]
["01010201","Establecidas en el código sustantivo de trabajo (CST) o régimen del empleado público (REP)",null,null,null,null,null,null,null,null,null,null,null,null,null,null,null,null,0]
["01010202","Adicionales o no establecidas en el código sustantivo de trabajo o régimen del empleado público",null,null,null,null,null,null,null,null,null,null,null,null,null,null,null,null,0]
["01010300","Aportes a seguridad social y aportes a la nómina",null,{"$f":"SUM(D11:D12)","v":0},{"$f":"SUM(E11:E12)","v":0},0,0,0,0,0,0,0,0,0,0,0,0,0,0]
["01010301","Establecidas en el código sustantivo de trabajo (CST) o régimen del empleado público (REP)",null,null,null,null,null,null,null,null,null,null,null,null,null,null,null,null,0]
["01010302","Adicionales o no establecidas en el código sustantivo de trabajo o régimen del empleado público",null,null,null,null,null,null,null,null,null,null,null,null,null,null,null,null,0]
["01010400","Otros pagos laborales",null,null,null,null,null,null,null,null,null,null,null,null,null,null,null,null,0]
["01010500","Medicina prepagada",null,null,null,null,null,null,null,null,null,null,null,null,null,null,null,null,0]
["01010600","Terminación del vínculo laboral",null,null,null,null,null,null,null,null,null,null,null,null,null,null,null,null,0]
["01010700","Beneficios a empleados a largo plazo",null,null,null,null,null,null,null,null,null,null,null,null,null,null,null,null,0]
["01010800","Beneficios posempleo",null,null,null,null,null,null,null,null,null,null,null,null,null,null,null,null,0]
["01010900","Cálculo actuarial y pensiones de jubilación",null,null,null,null,null,null,null,null,null,null,null,null,null,null,null,null,0]
["01011000","Gastos de personal sin vínculo laboral",null,null,null,null,null,null,null,null,null,null,null,null,null,null,null,null,0]
["01020000","GENERALES","X",{"$f":"SUM(D21:D28)","v":0},{"$f":"SUM(E21:E28)","v":0},0,0,0,0,0,0,0,0,0,0,0,0,0,0]
["01020100","Gastos de organización y puesta en marcha","X",null,null,null,null,null,null,null,null,null,null,null,null,null,null,null,0]
["01020200","Estudios y proyectos","X",null,null,null,null,null,null,null,null,null,null,null,null,null,null,null,0]
["01020300","Publicidad y propaganda",null,null,null,null,null,null,null,null,null,null,null,null,null,null,null,null,0]
["01020400","Gastos de exploración y desarrollo","X",null,null,null,null,null,null,null,null,null,null,null,null,null,null,null,0]
["01020500","Gastos de administración y funcionamiento ",null,null,null,null,null,null,null,null,null,null,null,null,null,null,null,null,0]
["01020600","Arrendamiento operativo",null,null,null,null,null,null,null,null,null,null,null,null,null,null,null,null,0]
["01020700","Otros gastos de administración y funcionamiento",null,null,null,null,null,null,null,null,null,null,null,null,null,null,null,null,0]
["01020800","Mantenimiento",null,null,null,null,null,null,null,null,null,null,null,null,null,null,null,null,{"$f":"SUM(D28:R28)","v":0}]
["01030000","IMPUESTOS, CONTRIBUCIONES Y TASAS","X",{"$f":"SUM(D30:D40)","v":0},{"$f":"SUM(E30:E40)","v":0},0,0,0,0,0,0,0,0,0,0,0,0,0,0]
["01030100","Impuestos municipales y de operación",null,null,null,null,null,null,null,null,null,null,null,null,null,null,null,null,0]
{"$rows_left_out":109}
{"sheet":"Referencias Normativas","index":2,"n_rows":40,"n_cols":5,"rows_kept":40,"cut":false,"hidden":false,"merged":[]}
["Código Concepto","Descripción concepto","Referencia Normativa Grupo 1","Referencia Normativa  Grupo 2","Referencia Res. 414/14"]
["01000000","GASTOS","NIIF Plenas. Marco Conceptual. Párrafos 4.2, 4.21, 4.24, 4.25, 4.28, 4.33 a 4.35, 4.49 a 4.53","NIIF Pymes Sección 2, Párrafos 26 a 28;  Párrafo 42; Sección 5 Párrafo 5 (b), 11","Resolución 414 Marco conceptual Num. 6.1.5., 6.2.4"]
["01010000","BENEFICIOS A EMPLEADOS","NIC 1.102 Ejemplo, NIC 1.104 Información a revelar, NIC 1.99 Información a revelar\nNIC 19.  Párrrafo 1, 11, 18, 37, 50, 51, 55, 56, 72, 103, 141, 158, 165, 170","NIIF Pymes Sección 28, Párrrafo 1, 3 (b)\nNIIF Pymes Sección 28, Párrafos 4 a 38","Cap. 2 Pasivos - 5.  Beneficios a empleados."]
["01020000","GENERALES","NIC 1.103 Ejemplo, NIC 1.99 Información a revelar, NIC 26.35 b (vi) Información a revelar","NIIF Pymes Sección 2, Párrafos 26 a 28;  Párrafo 42; Sección 5 Párrafo 5 (b), 11","Resolución 414 Marco conceptual Num. 6.1.5., 6.2.4, "]
["01020100","Gastos de organización y puesta en marcha","NIC 38.  Párrafo 8. Inciso 5 y 8.  Párrafo 34.  Fase de investigación Párrafo 54 a 56 Fase de desarrollo Párrafo 57 a 64\n68 a 71\n"," ","Cap.I - Activos. 12.  Activos intangibles. Párrafo 22"]
["01020200","Estudios y proyectos","NIC 38.  Párrafo 8. Inciso 5 y 8.  Párrafo 34.  Fase de investigación Párrafo 54 a 56 Fase de desarrollo Párrafo 57 a 64\n68 a 71\n"," ","Cap.I - Activos. 12.  Activos intangibles. Párrafo 22"]
["01020400","Gastos de exploración y desarrollo","NIC 38.  Párrafo 8. Inciso 5 y 8.  Párrafo 34.  Fase de investigación Párrafo 54 a 56 Fase de desarrollo Párrafo 57 a 64\n68 a 71\n"," ","Cap.I - Activos. 12.  Activos intangibles. Párrafo 22"]
["01030000","IMPUESTOS, CONTRIBUCIONES Y TASAS","NIIF Plenas. Marco Conceptual. Párrafos 4.2, 4.21, 4.24, 4.25, 4.28, 4.33 a 4.35, 4.49 a 4.53","NIIF Pymes Sección 2, Párrafos 26 a 28;  Párrafo 42; Sección 5 Párrafo 5 (b), 11","Resolución 414 Marco conceptual Num. 6.1.5., 6.2.4, "]
["01040000","IMPUESTO A LAS GANANCIAS CORRIENTE","NIC 12. Párrafo 5, 6,  21, 22, 58, 77","NIIF Pymes Sección 29, Párrrafos 4 a 6 y  32 y 33","Cap. II. Pasivos.  2.  Impuesto a las ganancias"]
["01050000","IMPUESTO A LAS GANANCIAS DIFERIDO","NIC 12. Párrafo 5, 6,  21, 22, 58, 77","NIIF Pymes Sección 29, Párrrafo 7 a 33","Cap. II. Pasivos.  2.  Impuesto a las ganancias"]
["01060000","DETERIORO, DEPRECIACIONES, AMORTIZACIONES Y PROVISIONES","IAS 1 99, IFRS 8 23 e, IAS 1 102, IAS 1 104, IFRS 8 28 e, IFRS 12 B13 d"]
["01060100","Depreciación","IAS 1 112 c\nNIC 1.102 Ejemplo, NIC 1.104 Información a revelar, NIC 1.99 Información a revelar, NIIF 12.B13 d Información a revelar, NIIF 8.23 e Información a revelar, NIIF 8.28 e Información a revelar\nNIC 7.20 b Práctica común","NIIF Pymes Sección 17, Párrafos 16 a 23","Cap. I - Activos - 10. Propiedad, planta y equipo.  Párrafos 19 a 29"]
["01060200","Amortización","IAS 1 112 c\nNIC 1.102 Ejemplo, NIC 1.104 Información a revelar, NIC 1.99 Información a revelar, NIIF 12.B13 d Información a revelar, NIIF 8.23 e Información a revelar, NIIF 8.28 e Información a revelar\nNIC 7.20 b Práctica común","NIIF Pymes Sección 18. Párrafos 21 y 22","Cap.I - Activos. 12.  Activos intangibles. Párrafo 27 a 36\nCapitulo II Pasivos. 2. Emisión de títulos dde deuda. Párrafo "]
["01060201","Amortización licencias y software","IAS 38, 8, 66,74,75, 89, 97-106, 107, 118 e vi, IAS 38 119"]
["01060202","Amortización arriendos","NIIF 16 IN11, Párrafo 31, 32, 49, 62"]
["01060300","Deterioro","NIC 7.20 b Práctica común\nNIC 36. Párrafo 60, 61, 119, 120","NIIF Pymes Sección 27\nSección 11, Párrafos 21 a 26, 48.  Sección 17 Párrafos 24 a 26 ","Cap.I - Activos. 16. Deterioro del valor de los activos. Párrafo 50\n1. Inversiones de administración de liquidez. Párrafo 17, 18, 21, 24, 26\n2. Cuentas por cobrar \nPárrafo 8\n9. Inventarios Párrafo 5, 27\nPropiedad, planta y equipo.  Párrafo 30\n12.  Activos Intangibles.  Párrafo 37"]
["01060400","Provisiones","NIC 7.20 b Práctica común\nNIC 37 1, 11 a 26","NIIF Pymes Sección 21, Párrafo 1 al 6. Apéndice.\nSección 32. Párrafo 5","Cap. II Pasivos. 6. Provisiones."]
["01070000","OTROS GASTOS","NIC 1.103 Ejemplo, NIC 1.99 Información a revelar, NIC 26.35 b (vii) Información a revelar","NIIF Pymes Sección 2, Párrafos 26 a 28;  Párrafo 42; Sección 5 Párrafo 5 (b), 11","Resolución 414 Marco conceptual Num. 6.1.5., 6.2.4, "]
["01070100","Financieros y comisiones","NIC 17. Párrafo 27\nNIC 23. Párrafo 1, 8","NIIF Pymes Sección 25 Párrafo 2","Cap.I. Activos - 9. Inventarios Párrafo 5\n10. Propiedades, planta y Equipo.  Párrafo 10\n12.  Activo Intangibles - Párrafo 17\n15.  Costos de financiación.  Párrafo 2, 11 y 12\n"]
["01070200","Pérdidas por la aplicación del método de participación patrimonial","NIC 24, NIC 28. 10 a 39","NIIF Pymes Sección 14","Cap.I. Activos.  5. Inversiones en controladas\n6.  Inversiones en asociadas"]
["01070300","Gastos diversos ","NIIF Plenas. Marco Conceptual. Párrafos 4.2, 4.21, 4.24, 4.25, 4.28, 4.33 a 4.35, 4.49 a 4.53","NIIF Pymes Sección 2, Párrafos 26 a 28;  Párrafo 42; Sección 5 Párrafo 5 (b), 11","Resolución 414 Marco conceptual Num. 6.1.5., 6.2.4, "]
["01070400","Ajuste por diferencia en cambio","NIC 21","NIIF Pymes Sección 30, Párrrafos 9 al 23","Cap. V. Otras normas.  1.  Efectos en las variaciones en las tasas de cambio."]
["02000000","COSTOS","NIIF Plenas. Marco Conceptual. Párrafos 4.2, 4.21, 4.24, 4.25, 4.28, 4.33 a 4.35, 4.49 a 4.53","NIIF Pymes Sección 2, Párrafos 26 a 28;  Párrafo 42; Sección 5 Párrafo 5 (b), 11","Resolución 414 Marco conceptual Num. 6.1.6., 6.2.4"]
["02010000","BENEFICIOS A EMPLEADOS","NIC 1.102 Ejemplo, NIC 1.104 Información a revelar, NIC 1.99 Información a revelar\nNIC 19.  Párrrafo 1, 11, 18, 37, 50, 51, 55, 56, 72, 103, 141, 158, 165, 170","NIIF Pymes Sección 28, Párrrafo 1, 3 (b)\nNIIF Pymes Sección 28, Párrafos 4 a 38","Cap. 2 Pasivos - 5.  Beneficios a empleados."]
["02020000","GENERALES","NIIF Plenas. Marco Conceptual. Párrafos 4.2, 4.21, 4.24, 4.25, 4.28, 4.33 a 4.35, 4.49 a 4.53","NIIF Pymes Sección 2, Párrafos 26 a 28;  Párrafo 42; Sección 5 Párrafo 5 (b), 11","Resolución 414 Marco conceptual Num. 6.1.5., 6.2.4, "]
["02020100","Estudios y proyectos","NIC 38.  Párrafo 8. Inciso 5 y 8.  Párrafo 34.  Fase de investigación Párrafo 54 a 56\nFase de desarrollo Párrafo 57 a 64\n68 a 71\n",null,"Cap.I - Activos. 12.  Activos intangibles. Párrafo 22"]
["02030000","IMPUESTOS, CONTRIBUCIONES Y TASAS","NIIF Plenas. Marco Conceptual. Párrafos 4.2, 4.21, 4.24, 4.25, 4.28, 4.33 a 4.35, 4.49 a 4.53","NIIF Pymes Sección 2, Párrafos 26 a 28;  Párrafo 42; Sección 5 Párrafo 5 (b), 11","Resolución 414 Marco conceptual Num. 6.1.5., 6.2.4, "]
["02040000","ARRENDAMIENTOS","NIC 17. Párrafo 33, 34","Sección 20. Párrafos 15 y 16.  22","Cap. I Activos - 13. Arrendamientos. Párrafo 42, 47"]
["02050000","DEPRECIACIONES","IAS 1 112 c\nNIC 1.102 Ejemplo, NIC 1.104 Información a revelar, NIC 1.99 Información a revelar, NIIF 12.B13 d Información a revelar, NIIF 8.23 e Información a revelar, NIIF 8.28 e Información a revelar\nNIC 7.20 b Práctica común","NIIF Pymes Sección 17, Párrafos 16 a 23","Cap. I - Activos - 10. Propiedad, planta y equipo.  Párrafos 19 a 29"]
["02060000","AMORTIZACIONES","IAS 1 112 c\nNIC 1.102 Ejemplo, NIC 1.104 Información a revelar, NIC 1.99 Información a revelar, NIIF 12.B13 d Información a revelar, NIIF 8.23 e Información a revelar, NIIF 8.28 e Información a revelar\nNIC 7.20 b Práctica común","NIIF Pymes Sección 18. Párrafos 21 y 22","Cap.I - Activos. 12.  Activos intangibles. Párrafo 27 a 36\nCapitulo II Pasivos. 2. Emisión de títulos dde deuda. Párrafo "]
{"$rows_left_out":11}
{"sheet":"Matriz de Conciliación","index":3,"n_rows":520,"n_cols":4,"rows_kept":520,"cut":false,"hidden":false,"merged":[]}
["Código SSPD PUC","Código CGN PUC","Código CREG ICR","Nombre Concepto CREG ICR / Cuenta PUC"]
["","","01000000","GASTOS"]
["","","01010000","BENEFICIOS A EMPLEADOS"]
["","","01010100","Sueldos y salarios"]
["510101","510101","","← Sueldos"]
["510102","510102","","← Jornales"]
["510103","510103","","← Horas extras y festivos"]
["510201","510201","","← Incapacidades"]
["510108","510108","","← Sueldos por comisiones al exterior"]
["510123","510123","","← Auxilio de transporte"]
["510145","510145","","← Salario integral"]
["","","01010200","Primas y prestaciones sociales"]
["","","01010201","Establecidas en el código sustantivo de trabajo (CST) o régimen del empleado público (REP)"]
["510117","510701","","← Vacaciones"]
["510124","510702","","← Cesantías"]
["510125","510703","","← Intereses a las cesantías"]
["510113","510704","","← Prima de vacaciones"]
["510114","510705","","← Prima de navidad"]
["510152","510706","","← Prima de servicios"]
["510110","510110","","← Primas técnicas"]
["510111","510111","","← Prima de dirección"]
["510112","510112","","← Prima especial de servicios"]
["510156"," ","","← Prima de coordinación"]
["510160","510160","","← Subsidio de alimentación"]
["510118","","","← Bonificación especial de recreación"]
["510131","510804","","← Dotación y suministro a trabajadores"]
["510121","","","← Prima de costos de vida"]
["510153","","","← Prima de actividad"]
["510158","","","← Prima de instalación y alojamiento"]
["","","01010202","Adicionales o no establecidas en el código sustantivo de trabajo o régimen del empleado público"]
{"$rows_left_out":491}
{"sheet":"Poliductos","index":4,"n_rows":25,"n_cols":4,"rows_kept":25,"cut":false,"hidden":false,"merged":[]}
["NOMBRE POLIDUCTO","CODIGO","EMPRESA","SIGLA"]
["GALÁN - SALGAR 8","POLID01","CENIT TRANSPORTE Y LOGISTICA DE HIDROCARBUROS S.A.S","CENIT"]
["GALÁN - SALGAR 12","POLID02","CENIT TRANSPORTE Y LOGISTICA DE HIDROCARBUROS S.A.S","CENIT"]
["GALÁN - SALGAR 16","POLID03","CENIT TRANSPORTE Y LOGISTICA DE HIDROCARBUROS S.A.S","CENIT"]
["JETDUCTO PUENTE ARANDA","POLID04","CENIT TRANSPORTE Y LOGISTICA DE HIDROCARBUROS S.A.S","CENIT"]
["SALGAR - CARTAGO 6","POLID05","CENIT TRANSPORTE Y LOGISTICA DE HIDROCARBUROS S.A.S","CENIT"]
["CARTAGO - YUMBO 6","POLID06","CENIT TRANSPORTE Y LOGISTICA DE HIDROCARBUROS S.A.S","CENIT"]
["SALGAR - BASE PALANQUERO","POLID07","CENIT TRANSPORTE Y LOGISTICA DE HIDROCARBUROS S.A.S","CENIT"]
["SALGAR - GUALANDAY","POLID08","CENIT TRANSPORTE Y LOGISTICA DE HIDROCARBUROS S.A.S","CENIT"]
["GUALANDAY - NEIVA","POLID09","CENIT TRANSPORTE Y LOGISTICA DE HIDROCARBUROS S.A.S","CENIT"]
["SALGAR - LA DORADA EXXON MOBIL","POLID10","CENIT TRANSPORTE Y LOGISTICA DE HIDROCARBUROS S.A.S","CENIT"]
["SALGAR MANSILLA","POLID11","CENIT TRANSPORTE Y LOGISTICA DE HIDROCARBUROS S.A.S","CENIT"]
["MANSILLA - PUENTE ARANDA","POLID12","CENIT TRANSPORTE Y LOGISTICA DE HIDROCARBUROS S.A.S","CENIT"]
["MEDELLÍN - CARTAGO","POLID13","CENIT TRANSPORTE Y LOGISTICA DE HIDROCARBUROS S.A.S","CENIT"]
["CARTAGO - YUMBO 10","POLID14","CENIT TRANSPORTE Y LOGISTICA DE HIDROCARBUROS S.A.S","CENIT"]
["SEBASTOPOL - MEDELLÍN","POLID15","CENIT TRANSPORTE Y LOGISTICA DE HIDROCARBUROS S.A.S","CENIT"]
["BUENAVENTURA - YUMBO","POLID16","CENIT TRANSPORTE Y LOGISTICA DE HIDROCARBUROS S.A.S","CENIT"]
["SALGAR - VISTA HERMOSA","POLID17","CENIT TRANSPORTE Y LOGISTICA DE HIDROCARBUROS S.A.S","CENIT"]
["CARTAGENA - BARANOA","POLID18","CENIT TRANSPORTE Y LOGISTICA DE HIDROCARBUROS S.A.S","CENIT"]
["GALÁN - CHIMITÁ","POLID19","CENIT TRANSPORTE Y LOGISTICA DE HIDROCARBUROS S.A.S","CENIT"]
["POLIANDINO","POLID20","CENIT TRANSPORTE Y LOGISTICA DE HIDROCARBUROS S.A.S","CENIT"]
["SEBASTOPOL - SUTAMARCHÁN","POLID21","CENIT TRANSPORTE Y LOGISTICA DE HIDROCARBUROS S.A.S","CENIT"]
["SUTAMARCHÁN - TOCANCIPÁ","POLID22","CENIT TRANSPORTE Y LOGISTICA DE HIDROCARBUROS S.A.S","CENIT"]
["POZOS COLORADOS - AYACUCHO - GALÁN","POLID23","CENIT TRANSPORTE Y LOGISTICA DE HIDROCARBUROS S.A.S","CENIT"]
["OTRAS ACTIVIDADES","POLID24","CENIT TRANSPORTE Y LOGISTICA DE HIDROCARBUROS S.A.S","CENIT"]

{"sheet":"ESRI_MAPINFO_SHEET","index":5,"n_rows":0,"n_cols":0,"rows_kept":0,"cut":false,"hidden":true,"merged":[]}