{"text_format":"1","workbook":"xlsx","n_sheets":6,"sheets":["Entrada","SerieDatos","Salidas","ENFICC","SerieENFICC","EDA"],"not_rendered":{"charts":0,"images":3,"macros":1,"external_links":0,"defined_names":3,"comments":0,"pivot_tables":0},"unopened":[],"bounds":{"document_bytes":16777216,"sheet_cells":100000,"rows_first":2000,"rows_last":500,"rows_between":2000,"halvings":0,"cell_chars":16384,"cell_head_chars":4096},"cells_cut":0,"cells_raw":0,"read":"whole","date_system":"1900"}

{"sheet":"Entrada","index":0,"n_rows":24,"n_cols":13,"rows_kept":24,"cut":false,"hidden":false,"merged":[[10,4,10,12],[2,7,2,8],[0,0,0,12]]}
["Datos de Planta (Solar Fotovoltaica)"]
[null,"Datos tomados en sitio (SI) o fuera de la ubicación de la planta (NO)"]
[null,"Factor aplicar de la constante de inclinación Kinc ",null,null,null,null,null,"Valores iniciales (kWh/día) "]
[null,"Constantes aplicar de pérdidas por temperatura",null,null,null,null,null,"ENFICC BASE"]
[null,"Potencia conjunto  de módulos fotovoltaicos POTdc (kW)",null,null,null,null,null,"ENFICC 95PSS"]
[0,"Indisponibilidad Histórica Forzada, IHF"]
[1,"Irradiancia ISTC (kW/m2)"]
[0.91390000000000005,"Constantes por pérdidas Kc "]
[]
[]
["Factor","Tecnología de estructura de soporte ","Kinc",null,"Factores y constantes a utilizar para cálculo ENFICC"]
["F1","Estructura fija orientada al SUR en inclinada en su grado óptimo.",0.96199999999999997,null,"ISTC","Kc","Kinc","a","b"," c","d","IHF","POT"]
["F2","Estructura de seguidor a un eje horizontal Norte-Sur y rotación Este-Oeste con retro- seguimiento",1.1860999999999999,null,{"$f":"A7","v":1},{"$f":"A8","v":0.91390000000000005},{"$f":"VLOOKUP($A$3,Entrada!$A$11:$C$15,3,FALSE)","v":{"$error":"#N/A"}},{"$f":"VLOOKUP(Entrada!$A$4,Entrada!$A$17:$F$24,3,FALSE)","v":{"$error":"#N/A"}},{"$f":"VLOOKUP(Entrada!$A$4,Entrada!$A$17:$F$24,4,FALSE)","v":{"$error":"#N/A"}},{"$f":"VLOOKUP(Entrada!$A$4,Entrada!$A$17:$F$24,5,FALSE)","v":{"$error":"#N/A"}},{"$f":"VLOOKUP(Entrada!$A$4,Entrada!$A$17:$F$24,6,FALSE)","v":{"$error":"#N/A"}},{"$f":"A6","v":0},{"$f":"A5","v":0}]
["F3","Estructura de seguidor a un eje inclinado Norte-Sur y rotación Este-Oeste con retro- seguimiento",1.1958]
["F4","Estructura de seguidor a dos ejes sin retro- seguimiento",1.2529999999999999]
[]
["Constantes","Tipo módulo y estructura","a","b","c","d"]
["C1","Fija - cSi",3.8000000000000002E-5,-2.3999999999999998E-3,5.2240000000000002E-2,-0.31209999999999999]
["C2","Fija - TF",2.5999999999999998E-5,-1.6999999999999999E-3,3.73E-2,-0.21260000000000001]
["C3","1 Eje - cSi Plano",1.1E-5,-6.9999999999999999E-4,1.8499999999999999E-2,-0.1157]
["C4","1 Eje - cSi Inclinado",1.1E-5,-6.9999999999999999E-4,1.8499999999999999E-2,-0.1157]
["C5","1 Eje - TF Plano",-1.2999999999999999E-5,6.9999999999999999E-4,-9.1999999999999998E-3,5.0099999999999999E-2]
["C6","1 Eje - TF inclinado",-1.2999999999999999E-5,7.3999999999999999E-4,-9.1999999999999998E-3,5.0110000000000002E-2]
["C7","2Ejes - cSi",3.7000000000000002E-6,-2.0000000000000001E-4,1.0319999999999999E-2,-6.1499999999999999E-2]

{"sheet":"SerieDatos","index":1,"n_rows":1,"n_cols":6,"rows_kept":1,"cut":false,"hidden":false,"merged":[]}
["Fecha","Hora","GHI (kWh)","TA (°C)","Año","Mes"]

{"sheet":"Salidas","index":2,"n_rows":1,"n_cols":7,"rows_kept":1,"cut":false,"hidden":false,"merged":[]}
["Año","Mes","GHI_m (kWh/mes)","TA_m (°C)","V_m","EN_m (kWh/mes)","E_n (kWh/día)"]

{"sheet":"ENFICC","index":3,"n_rows":3,"n_cols":9,"rows_kept":3,"cut":false,"hidden":false,"merged":[[0,5,0,6]]}
["Año","Mes","E_n (kWh/día)",null,null,"Valores iniciales ",null,"Año referencia","Mes referencia"]
[null,null,null,null,null,"ENFICC BASE (kWh/día)"]
[null,null,null,null,null,"ENFICC 95PSS (kWh/día)"]

{"sheet":"SerieENFICC","index":4,"n_rows":21,"n_cols":10,"rows_kept":21,"cut":false,"hidden":false,"merged":[[0,6,0,7]]}
["AÑO","Kmed,t sin datos en sitio ","Kmed,t con datos en sitio ","ENFICCt BASE (kWh/día)","ENFICCt 95PSS (kWh/día)",null,"Valores iniciales ",null,"Año referencia","Mes referencia"]
[1,0.87365000000000004,0.88990000000000002,null,null,null,"ENFICC BASE (kWh/día)"]
[2,0.85834999999999995,0.87434999999999996,null,null,null,"ENFICC 95PSS (kWh/día)"]
[3,0.85399999999999998,0.86985000000000001]
[4,0.84960000000000002,0.86539999999999995]
[5,0.84525000000000006,0.86099999999999999]
[6,0.84084999999999999,0.85650000000000004]
[7,0.83650000000000002,0.85209999999999997]
[8,0.83214999999999995,0.84760000000000002]
[9,0.82774999999999999,0.84319999999999995]
[10,0.82340000000000002,0.8387]
[11,0.81905000000000006,0.83430000000000004]
[12,0.81464999999999999,0.82980000000000009]
[13,0.81030000000000002,0.82539999999999991]
[14,0.80590000000000006,0.82095000000000007]
[15,0.80159999999999998,0.81645000000000001]
[16,0.79719999999999991,0.81204999999999994]
[17,0.79279999999999995,0.80754999999999999]
[18,0.7884500000000001,0.80315000000000003]
[19,0.78410000000000002,0.79864999999999997]
[20,0.77974999999999994,0.79425000000000001]

{"sheet":"EDA","index":5,"n_rows":25,"n_cols":18,"rows_kept":25,"cut":false,"hidden":false,"merged":[[1,6,1,9]]}
[]
["ENFICC DECLARADO",null,null,null,null,null,"ENFICC (kWh/día) DECLARADO A UTILIZAR:"]
[3000]
[]
["Año","EDA \nDiciembre\n(kWh/día)","EDA \nEnero\n(kWh/día)","EDA \nfebrero\n(kWh/día)","EDA \nmarzo\n(kWh/día)","EDA \nabril\n(kWh/día)","EDA \nmayo\n(kWh/día)","EDA \njunio\n(kWh/día)","EDA \njulio\n(kWh/día)","EDA \nagosto\n(kWh/día)","EDA \nseptiembre\n(kWh/día)","EDA \noctubre\n(kWh/día)","EDA \nnoviembre\n(kWh/día)",null,null,"Año de referencia","Mes de referencia","En \nde referencia\n(kWh/día)"]
[1]
[2]
[3]
[4]
[5]
[6]
[7]
[8]
[9]
[10]
[11]
[12]
[13]
[14]
[15]
[16]
[17]
[18]
[19]
[20]