{"text_format":"1","workbook":"xlsx","n_sheets":9,"sheets":["PARTICIPANTES","DEMANDA REGULADA","DEMANDA NR","OFERTA INICIAL","SUBASTADOR","OFERTAS","ASIGNACIONES","OFERTA ACUMULADA","RONDAS"],"not_rendered":{"charts":7,"images":0,"macros":1,"external_links":0,"defined_names":29,"comments":0,"pivot_tables":0},"unopened":[],"bounds":{"document_bytes":16777216,"sheet_cells":100000,"rows_first":2000,"rows_last":500,"rows_between":2000,"halvings":0,"cell_chars":16384,"cell_head_chars":4096},"cells_cut":0,"cells_raw":0,"read":"whole","date_system":"1900"}

{"sheet":"PARTICIPANTES","index":0,"n_rows":22,"n_cols":8,"rows_kept":22,"cut":false,"hidden":false,"merged":[]}
[]
["ID","VENDEDORES",null,"ID","COMPRADORES DNR",null,"VENDEDORES",{"$f":"20-COUNTBLANK(VENDEDORES)","v":0}]
[1,null,null,1,null,null,"COMPRADORES",{"$f":"20-COUNTBLANK(COMPRADORES)","v":0}]
[2,null,null,2]
[3,null,null,3]
[4,null,null,4]
[5,null,null,5]
[6,null,null,6]
[7,null,null,7]
[8,null,null,8]
[9,null,null,9]
[10,null,null,10]
[11,null,null,11]
[12,null,null,12]
[13,null,null,13]
[14,null,null,14]
[15,null,null,15]
[16,null,null,16]
[17,null,null,17]
[18,null,null,18]
[19,null,null,19]
[20,null,null,20]

{"sheet":"DEMANDA REGULADA","index":1,"n_rows":203,"n_cols":7,"rows_kept":203,"cut":false,"hidden":false,"merged":[[1,1,1,2]]}
[]
[null,"CURVA DE DEMANDA REGULADA"]
["ID","PRECIO                 ($/kWh)","NUM PRODUCTOS"]
[1,{"$f":"+$F$5-(($F$5/199)*(A4-1))","v":0},{"$f":"+ROUND(IF(B4>$F$6,(B4-$F$5)/(($F$6-$F$5)/$F$4),$F$4),0)","v":0},null,"DEM OB",null,"Productos"]
[2,{"$f":"+$F$5-(($F$5/199)*(A5-1))","v":0},{"$f":"+ROUND(IF(B5>$F$6,(B5-$F$5)/(($F$6-$F$5)/$F$4),$F$4),0)","v":0},null,"PP2",null,"$/kWh"]
[3,0,0,null,"PP1",null,"$/kWh"]
[4,0,0]
[5,0,0]
[6,0,0]
[7,0,0]
[8,0,0]
[9,0,0]
[10,0,0]
[11,0,0]
[12,0,0]
[13,0,0]
[14,0,0]
[15,0,0]
[16,0,0]
[17,0,0]
[18,0,0]
[19,0,0]
[20,0,0]
[21,0,0]
[22,0,0]
[23,0,0]
[24,0,0]
[25,0,0]
[26,0,0]
[27,0,0]
[28,0,0]
[29,0,0]
[30,0,0]
[31,0,0]
[32,0,0]
[33,0,0]
[34,0,0]
[35,0,0]
[36,0,0]
[37,0,0]
[38,0,0]
[39,0,0]
[40,0,0]
[41,0,0]
[42,0,0]
[43,0,0]
[44,0,0]
[45,0,0]
[46,0,0]
[47,0,0]
[48,0,0]
[49,0,0]
[50,0,0]
[51,0,0]
[52,0,0]
[53,0,0]
[54,0,0]
[55,0,0]
[56,0,0]
[57,0,0]
[58,0,0]
[59,0,0]
[60,0,0]
[61,0,0]
[62,0,0]
[63,0,0]
[64,0,0]
[65,0,0]
[66,{"$f":"+$F$5-(($F$5/199)*(A69-1))","v":0},{"$f":"+ROUND(IF(B69>$F$6,(B69-$F$5)/(($F$6-$F$5)/$F$4),$F$4),0)","v":0}]
[67,0,0]
[68,0,0]
[69,0,0]
[70,0,0]
[71,0,0]
[72,0,0]
[73,0,0]
[74,0,0]
[75,0,0]
[76,0,0]
[77,0,0]
[78,0,0]
[79,0,0]
[80,0,0]
[81,0,0]
[82,0,0]
[83,0,0]
[84,0,0]
[85,0,0]
[86,0,0]
[87,0,0]
[88,0,0]
[89,0,0]
[90,0,0]
[91,0,0]
[92,0,0]
[93,0,0]
[94,0,0]
[95,0,0]
[96,0,0]
[97,0,0]
[98,0,0]
[99,0,0]
[100,0,0]
[101,0,0]
[102,0,0]
[103,0,0]
[104,0,0]
[105,0,0]
[106,0,0]
[107,0,0]
[108,0,0]
[109,0,0]
[110,0,0]
[111,0,0]
[112,0,0]
[113,0,0]
[114,0,0]
[115,0,0]
[116,0,0]
[117,0,0]
[118,0,0]
[119,0,0]
[120,0,0]
[121,0,0]
[122,0,0]
[123,0,0]
[124,0,0]
[125,0,0]
[126,0,0]
[127,0,0]
[128,0,0]
[129,0,0]
[130,{"$f":"+$F$5-(($F$5/199)*(A133-1))","v":0},{"$f":"+ROUND(IF(B133>$F$6,(B133-$F$5)/(($F$6-$F$5)/$F$4),$F$4),0)","v":0}]
[131,0,0]
[132,0,0]
[133,0,0]
[134,0,0]
[135,0,0]
[136,0,0]
[137,0,0]
[138,0,0]
[139,0,0]
[140,0,0]
[141,0,0]
[142,0,0]
[143,0,0]
[144,0,0]
[145,0,0]
[146,0,0]
[147,0,0]
[148,0,0]
[149,0,0]
[150,0,0]
[151,0,0]
[152,0,0]
[153,0,0]
[154,0,0]
[155,0,0]
[156,0,0]
[157,0,0]
[158,0,0]
[159,0,0]
[160,0,0]
[161,0,0]
[162,0,0]
[163,0,0]
[164,0,0]
[165,0,0]
[166,0,0]
[167,0,0]
[168,0,0]
[169,0,0]
[170,0,0]
[171,0,0]
[172,0,0]
[173,0,0]
[174,0,0]
[175,0,0]
[176,0,0]
[177,0,0]
[178,0,0]
[179,0,0]
[180,0,0]
[181,0,0]
[182,0,0]
[183,0,0]
[184,0,0]
[185,0,0]
[186,0,0]
[187,0,0]
[188,0,0]
[189,0,0]
[190,0,0]
[191,0,0]
[192,0,0]
[193,0,0]
[194,{"$f":"+$F$5-(($F$5/199)*(A197-1))","v":0},{"$f":"+ROUND(IF(B197>$F$6,(B197-$F$5)/(($F$6-$F$5)/$F$4),$F$4),0)","v":0}]
[195,0,0]
[196,0,0]
[197,0,0]
[198,0,0]
[199,0,0]
[200,0,0]

{"sheet":"DEMANDA NR","index":2,"n_rows":1002,"n_cols":9,"rows_kept":1002,"cut":false,"hidden":false,"merged":[[0,1,0,4],[0,7,0,8]]}
[null,"DEMANDA NR POR AGENTE",null,null,null,null,null,"DEMANDA NR AGREGADA"]
["ID","AGENTE","PRECIO   ($/kWh)","NUM PRODUCTOS","VÁLIDO",null,"ID","PRECIO   ($/kWh)","NUM PRODUCTOS"]
[1,null,null,null,{"$f":"+IF(ISERROR(VLOOKUP(B3,COMPRADORES,1,FALSE)),\"NO\",\"SI\")","v":"NO"},null,1,1E-4,0]
[2,null,null,null,"NO",null,2,0,0]
[3,null,null,null,"NO",null,3]
[4,null,null,null,"NO",null,4]
[5,null,null,null,"NO",null,5]
[6,null,null,null,"NO",null,6]
[7,null,null,null,"NO",null,7]
[8,null,null,null,"NO",null,8]
[9,null,null,null,"NO",null,9]
[10,null,null,null,"NO",null,10]
[11,null,null,null,"NO",null,11]
[12,null,null,null,"NO",null,12]
[13,null,null,null,"NO",null,13]
[14,null,null,null,"NO",null,14]
[15,null,null,null,"NO",null,15]
[16,null,null,null,"NO",null,16]
[17,null,null,null,"NO",null,17]
[18,null,null,null,"NO",null,18]
[19,null,null,null,"NO",null,19]
[20,null,null,null,"NO",null,20]
[21,null,null,null,"NO",null,21]
[22,null,null,null,"NO",null,22]
[23,null,null,null,"NO",null,23]
[24,null,null,null,"NO",null,24]
[25,null,null,null,"NO",null,25]
[26,null,null,null,"NO",null,26]
[27,null,null,null,"NO",null,27]
[28,null,null,null,"NO",null,28]
[29,null,null,null,"NO",null,29]
[30,null,null,null,"NO",null,30]
[31,null,null,null,"NO",null,31]
[32,null,null,null,"NO",null,32]
[33,null,null,null,"NO",null,33]
[34,null,null,null,"NO",null,34]
[35,null,null,null,"NO",null,35]
[36,null,null,null,"NO",null,36]
[37,null,null,null,"NO",null,37]
[38,null,null,null,"NO",null,38]
[39,null,null,null,"NO",null,39]
[40,null,null,null,"NO",null,40]
[41,null,null,null,"NO",null,41]
[42,null,null,null,"NO",null,42]
[43,null,null,null,"NO",null,43]
[44,null,null,null,"NO",null,44]
[45,null,null,null,"NO",null,45]
[46,null,null,null,"NO",null,46]
[47,null,null,null,"NO",null,47]
[48,null,null,null,"NO",null,48]
[49,null,null,null,"NO",null,49]
[50,null,null,null,"NO",null,50]
[51,null,null,null,"NO",null,51]
[52,null,null,null,"NO",null,52]
[53,null,null,null,"NO",null,53]
[54,null,null,null,"NO",null,54]
[55,null,null,null,"NO",null,55]
[56,null,null,null,"NO",null,56]
[57,null,null,null,"NO",null,57]
[58,null,null,null,"NO",null,58]
[59,null,null,null,"NO",null,59]
[60,null,null,null,"NO",null,60]
[61,null,null,null,"NO",null,61]
[62,null,null,null,"NO",null,62]
[63,null,null,null,"NO",null,63]
[64,null,null,null,"NO",null,64]
[65,null,null,null,{"$f":"+IF(ISERROR(VLOOKUP(B67,COMPRADORES,1,FALSE)),\"NO\",\"SI\")","v":"NO"},null,65]
[66,null,null,null,"NO",null,66]
[67,null,null,null,"NO",null,67]
[68,null,null,null,"NO",null,68]
[69,null,null,null,"NO",null,69]
[70,null,null,null,"NO",null,70]
[71,null,null,null,"NO",null,71]
[72,null,null,null,"NO",null,72]
[73,null,null,null,"NO",null,73]
[74,null,null,null,"NO",null,74]
[75,null,null,null,"NO",null,75]
[76,null,null,null,"NO",null,76]
[77,null,null,null,"NO",null,77]
[78,null,null,null,"NO",null,78]
[79,null,null,null,"NO",null,79]
[80,null,null,null,"NO",null,80]
[81,null,null,null,"NO",null,81]
[82,null,null,null,"NO",null,82]
[83,null,null,null,"NO",null,83]
[84,null,null,null,"NO",null,84]
[85,null,null,null,"NO",null,85]
[86,null,null,null,"NO",null,86]
[87,null,null,null,"NO",null,87]
[88,null,null,null,"NO",null,88]
[89,null,null,null,"NO",null,89]
[90,null,null,null,"NO",null,90]
[91,null,null,null,"NO",null,91]
[92,null,null,null,"NO",null,92]
[93,null,null,null,"NO",null,93]
[94,null,null,null,"NO",null,94]
[95,null,null,null,"NO",null,95]
[96,null,null,null,"NO",null,96]
[97,null,null,null,"NO",null,97]
[98,null,null,null,"NO",null,98]
[99,null,null,null,"NO",null,99]
[100,null,null,null,"NO",null,100]
[101,null,null,null,"NO",null,101]
[102,null,null,null,"NO",null,102]
[103,null,null,null,"NO",null,103]
[104,null,null,null,"NO",null,104]
[105,null,null,null,"NO",null,105]
[106,null,null,null,"NO",null,106]
[107,null,null,null,"NO",null,107]
[108,null,null,null,"NO",null,108]
[109,null,null,null,"NO",null,109]
[110,null,null,null,"NO",null,110]
[111,null,null,null,"NO",null,111]
[112,null,null,null,"NO",null,112]
[113,null,null,null,"NO",null,113]
[114,null,null,null,"NO",null,114]
[115,null,null,null,"NO",null,115]
[116,null,null,null,"NO",null,116]
[117,null,null,null,"NO",null,117]
[118,null,null,null,"NO",null,118]
[119,null,null,null,"NO",null,119]
[120,null,null,null,"NO",null,120]
[121,null,null,null,"NO",null,121]
[122,null,null,null,"NO",null,122]
[123,null,null,null,"NO",null,123]
[124,null,null,null,"NO",null,124]
[125,null,null,null,"NO",null,125]
[126,null,null,null,"NO",null,126]
[127,null,null,null,"NO",null,127]
[128,null,null,null,"NO",null,128]
[129,null,null,null,{"$f":"+IF(ISERROR(VLOOKUP(B131,COMPRADORES,1,FALSE)),\"NO\",\"SI\")","v":"NO"},null,129]
[130,null,null,null,"NO",null,130]
[131,null,null,null,"NO",null,131]
[132,null,null,null,"NO",null,132]
[133,null,null,null,"NO",null,133]
[134,null,null,null,"NO",null,134]
[135,null,null,null,"NO",null,135]
[136,null,null,null,"NO",null,136]
[137,null,null,null,"NO",null,137]
[138,null,null,null,"NO",null,138]
[139,null,null,null,"NO",null,139]
[140,null,null,null,"NO",null,140]
[141,null,null,null,"NO",null,141]
[142,null,null,null,"NO",null,142]
[143,null,null,null,"NO",null,143]
[144,null,null,null,"NO",null,144]
[145,null,null,null,"NO",null,145]
[146,null,null,null,"NO",null,146]
[147,null,null,null,"NO",null,147]
[148,null,null,null,"NO",null,148]
[149,null,null,null,"NO",null,149]
[150,null,null,null,"NO",null,150]
[151,null,null,null,"NO",null,151]
[152,null,null,null,"NO",null,152]
[153,null,null,null,"NO",null,153]
[154,null,null,null,"NO",null,154]
[155,null,null,null,"NO",null,155]
[156,null,null,null,"NO",null,156]
[157,null,null,null,"NO",null,157]
[158,null,null,null,"NO",null,158]
[159,null,null,null,"NO",null,159]
[160,null,null,null,"NO",null,160]
[161,null,null,null,"NO",null,161]
[162,null,null,null,"NO",null,162]
[163,null,null,null,"NO",null,163]
[164,null,null,null,"NO",null,164]
[165,null,null,null,"NO",null,165]
[166,null,null,null,"NO",null,166]
[167,null,null,null,"NO",null,167]
[168,null,null,null,"NO",null,168]
[169,null,null,null,"NO",null,169]
[170,null,null,null,"NO",null,170]
[171,null,null,null,"NO",null,171]
[172,null,null,null,"NO",null,172]
[173,null,null,null,"NO",null,173]
[174,null,null,null,"NO",null,174]
[175,null,null,null,"NO",null,175]
[176,null,null,null,"NO",null,176]
[177,null,null,null,"NO",null,177]
[178,null,null,null,"NO",null,178]
[179,null,null,null,"NO",null,179]
[180,null,null,null,"NO",null,180]
[181,null,null,null,"NO",null,181]
[182,null,null,null,"NO",null,182]
[183,null,null,null,"NO",null,183]
[184,null,null,null,"NO",null,184]
[185,null,null,null,"NO",null,185]
[186,null,null,null,"NO",null,186]
[187,null,null,null,"NO",null,187]
[188,null,null,null,"NO",null,188]
[189,null,null,null,"NO",null,189]
[190,null,null,null,"NO",null,190]
[191,null,null,null,"NO",null,191]
[192,null,null,null,"NO",null,192]
[193,null,null,null,{"$f":"+IF(ISERROR(VLOOKUP(B195,COMPRADORES,1,FALSE)),\"NO\",\"SI\")","v":"NO"},null,193]
[194,null,null,null,"NO",null,194]
[195,null,null,null,"NO",null,195]
[196,null,null,null,"NO",null,196]
[197,null,null,null,"NO",null,197]
[198,null,null,null,"NO",null,198]
[199,null,null,null,"NO",null,199]
[200,null,null,null,"NO",null,200]
[201,null,null,null,"NO"]
[202,null,null,null,"NO"]
[203,null,null,null,"NO"]
[204,null,null,null,"NO"]
[205,null,null,null,"NO"]
[206,null,null,null,"NO"]
[207,null,null,null,"NO"]
[208,null,null,null,"NO"]
[209,null,null,null,"NO"]
[210,null,null,null,"NO"]
[211,null,null,null,"NO"]
[212,null,null,null,"NO"]
[213,null,null,null,"NO"]
[214,null,null,null,"NO"]
[215,null,null,null,"NO"]
[216,null,null,null,"NO"]
[217,null,null,null,"NO"]
[218,null,null,null,"NO"]
[219,null,null,null,"NO"]
[220,null,null,null,"NO"]
[221,null,null,null,"NO"]
[222,null,null,null,"NO"]
[223,null,null,null,"NO"]
[224,null,null,null,"NO"]
[225,null,null,null,"NO"]
[226,null,null,null,"NO"]
[227,null,null,null,"NO"]
[228,null,null,null,"NO"]
[229,null,null,null,"NO"]
[230,null,null,null,"NO"]
[231,null,null,null,"NO"]
[232,null,null,null,"NO"]
[233,null,null,null,"NO"]
[234,null,null,null,"NO"]
[235,null,null,null,"NO"]
[236,null,null,null,"NO"]
[237,null,null,null,"NO"]
[238,null,null,null,"NO"]
[239,null,null,null,"NO"]
[240,null,null,null,"NO"]
[241,null,null,null,"NO"]
[242,null,null,null,"NO"]
[243,null,null,null,"NO"]
[244,null,null,null,"NO"]
[245,null,null,null,"NO"]
[246,null,null,null,"NO"]
[247,null,null,null,"NO"]
[248,null,null,null,"NO"]
[249,null,null,null,"NO"]
[250,null,null,null,"NO"]
[251,null,null,null,"NO"]
[252,null,null,null,"NO"]
[253,null,null,null,"NO"]
[254,null,null,null,"NO"]
[255,null,null,null,"NO"]
[256,null,null,null,"NO"]
[257,null,null,null,{"$f":"+IF(ISERROR(VLOOKUP(B259,COMPRADORES,1,FALSE)),\"NO\",\"SI\")","v":"NO"}]
[258,null,null,null,"NO"]
[259,null,null,null,"NO"]
[260,null,null,null,"NO"]
[261,null,null,null,"NO"]
[262,null,null,null,"NO"]
[263,null,null,null,"NO"]
[264,null,null,null,"NO"]
[265,null,null,null,"NO"]
[266,null,null,null,"NO"]
[267,null,null,null,"NO"]
[268,null,null,null,"NO"]
[269,null,null,null,"NO"]
[270,null,null,null,"NO"]
[271,null,null,null,"NO"]
[272,null,null,null,"NO"]
[273,null,null,null,"NO"]
[274,null,null,null,"NO"]
[275,null,null,null,"NO"]
[276,null,null,null,"NO"]
[277,null,null,null,"NO"]
[278,null,null,null,"NO"]
[279,null,null,null,"NO"]
[280,null,null,null,"NO"]
[281,null,null,null,"NO"]
[282,null,null,null,"NO"]
[283,null,null,null,"NO"]
[284,null,null,null,"NO"]
[285,null,null,null,"NO"]
[286,null,null,null,"NO"]
[287,null,null,null,"NO"]
[288,null,null,null,"NO"]
[289,null,null,null,"NO"]
[290,null,null,null,"NO"]
[291,null,null,null,"NO"]
[292,null,null,null,"NO"]
[293,null,null,null,"NO"]
[294,null,null,null,"NO"]
[295,null,null,null,"NO"]
[296,null,null,null,"NO"]
[297,null,null,null,"NO"]
[298,null,null,null,"NO"]
[299,null,null,null,"NO"]
[300,null,null,null,"NO"]
[301,null,null,null,"NO"]
[302,null,null,null,"NO"]
[303,null,null,null,"NO"]
[304,null,null,null,"NO"]
[305,null,null,null,"NO"]
[306,null,null,null,"NO"]
[307,null,null,null,"NO"]
[308,null,null,null,"NO"]
[309,null,null,null,"NO"]
[310,null,null,null,"NO"]
[311,null,null,null,"NO"]
[312,null,null,null,"NO"]
[313,null,null,null,"NO"]
[314,null,null,null,"NO"]
[315,null,null,null,"NO"]
[316,null,null,null,"NO"]
[317,null,null,null,"NO"]
[318,null,null,null,"NO"]
[319,null,null,null,"NO"]
[320,null,null,null,"NO"]
[321,null,null,null,{"$f":"+IF(ISERROR(VLOOKUP(B323,COMPRADORES,1,FALSE)),\"NO\",\"SI\")","v":"NO"}]
[322,null,null,null,"NO"]
[323,null,null,null,"NO"]
[324,null,null,null,"NO"]
[325,null,null,null,"NO"]
[326,null,null,null,"NO"]
[327,null,null,null,"NO"]
[328,null,null,null,"NO"]
[329,null,null,null,"NO"]
[330,null,null,null,"NO"]
[331,null,null,null,"NO"]
[332,null,null,null,"NO"]
[333,null,null,null,"NO"]
[334,null,null,null,"NO"]
[335,null,null,null,"NO"]
[336,null,null,null,"NO"]
[337,null,null,null,"NO"]
[338,null,null,null,"NO"]
[339,null,null,null,"NO"]
[340,null,null,null,"NO"]
[341,null,null,null,"NO"]
[342,null,null,null,"NO"]
[343,null,null,null,"NO"]
[344,null,null,null,"NO"]
[345,null,null,null,"NO"]
[346,null,null,null,"NO"]
[347,null,null,null,"NO"]
[348,null,null,null,"NO"]
[349,null,null,null,"NO"]
[350,null,null,null,"NO"]
[351,null,null,null,"NO"]
[352,null,null,null,"NO"]
[353,null,null,null,"NO"]
[354,null,null,null,"NO"]
[355,null,null,null,"NO"]
[356,null,null,null,"NO"]
[357,null,null,null,"NO"]
[358,null,null,null,"NO"]
[359,null,null,null,"NO"]
[360,null,null,null,"NO"]
[361,null,null,null,"NO"]
[362,null,null,null,"NO"]
[363,null,null,null,"NO"]
[364,null,null,null,"NO"]
[365,null,null,null,"NO"]
[366,null,null,null,"NO"]
[367,null,null,null,"NO"]
[368,null,null,null,"NO"]
[369,null,null,null,"NO"]
[370,null,null,null,"NO"]
[371,null,null,null,"NO"]
[372,null,null,null,"NO"]
[373,null,null,null,"NO"]
[374,null,null,null,"NO"]
[375,null,null,null,"NO"]
[376,null,null,null,"NO"]
[377,null,null,null,"NO"]
[378,null,null,null,"NO"]
[379,null,null,null,"NO"]
[380,null,null,null,"NO"]
[381,null,null,null,"NO"]
[382,null,null,null,"NO"]
[383,null,null,null,"NO"]
[384,null,null,null,"NO"]
[385,null,null,null,{"$f":"+IF(ISERROR(VLOOKUP(B387,COMPRADORES,1,FALSE)),\"NO\",\"SI\")","v":"NO"}]
[386,null,null,null,"NO"]
[387,null,null,null,"NO"]
[388,null,null,null,"NO"]
[389,null,null,null,"NO"]
[390,null,null,null,"NO"]
[391,null,null,null,"NO"]
[392,null,null,null,"NO"]
[393,null,null,null,"NO"]
[394,null,null,null,"NO"]
[395,null,null,null,"NO"]
[396,null,null,null,"NO"]
[397,null,null,null,"NO"]
[398,null,null,null,"NO"]
[399,null,null,null,"NO"]
[400,null,null,null,"NO"]
[401,null,null,null,"NO"]
[402,null,null,null,"NO"]
[403,null,null,null,"NO"]
[404,null,null,null,"NO"]
[405,null,null,null,"NO"]
[406,null,null,null,"NO"]
[407,null,null,null,"NO"]
[408,null,null,null,"NO"]
[409,null,null,null,"NO"]
[410,null,null,null,"NO"]
[411,null,null,null,"NO"]
[412,null,null,null,"NO"]
[413,null,null,null,"NO"]
[414,null,null,null,"NO"]
[415,null,null,null,"NO"]
[416,null,null,null,"NO"]
[417,null,null,null,"NO"]
[418,null,null,null,"NO"]
[419,null,null,null,"NO"]
[420,null,null,null,"NO"]
[421,null,null,null,"NO"]
[422,null,null,null,"NO"]
[423,null,null,null,"NO"]
[424,null,null,null,"NO"]
[425,null,null,null,"NO"]
[426,null,null,null,"NO"]
[427,null,null,null,"NO"]
[428,null,null,null,"NO"]
[429,null,null,null,"NO"]
[430,null,null,null,"NO"]
[431,null,null,null,"NO"]
[432,null,null,null,"NO"]
[433,null,null,null,"NO"]
[434,null,null,null,"NO"]
[435,null,null,null,"NO"]
[436,null,null,null,"NO"]
[437,null,null,null,"NO"]
[438,null,null,null,"NO"]
[439,null,null,null,"NO"]
[440,null,null,null,"NO"]
[441,null,null,null,"NO"]
[442,null,null,null,"NO"]
[443,null,null,null,"NO"]
[444,null,null,null,"NO"]
[445,null,null,null,"NO"]
[446,null,null,null,"NO"]
[447,null,null,null,"NO"]
[448,null,null,null,"NO"]
[449,null,null,null,{"$f":"+IF(ISERROR(VLOOKUP(B451,COMPRADORES,1,FALSE)),\"NO\",\"SI\")","v":"NO"}]
[450,null,null,null,"NO"]
[451,null,null,null,"NO"]
[452,null,null,null,"NO"]
[453,null,null,null,"NO"]
[454,null,null,null,"NO"]
[455,null,null,null,"NO"]
[456,null,null,null,"NO"]
[457,null,null,null,"NO"]
[458,null,null,null,"NO"]
[459,null,null,null,"NO"]
[460,null,null,null,"NO"]
[461,null,null,null,"NO"]
[462,null,null,null,"NO"]
[463,null,null,null,"NO"]
[464,null,null,null,"NO"]
[465,null,null,null,"NO"]
[466,null,null,null,"NO"]
[467,null,null,null,"NO"]
[468,null,null,null,"NO"]
[469,null,null,null,"NO"]
[470,null,null,null,"NO"]
[471,null,null,null,"NO"]
[472,null,null,null,"NO"]
[473,null,null,null,"NO"]
[474,null,null,null,"NO"]
[475,null,null,null,"NO"]
[476,null,null,null,"NO"]
[477,null,null,null,"NO"]
[478,null,null,null,"NO"]
[479,null,null,null,"NO"]
[480,null,null,null,"NO"]
[481,null,null,null,"NO"]
[482,null,null,null,"NO"]
[483,null,null,null,"NO"]
[484,null,null,null,"NO"]
[485,null,null,null,"NO"]
[486,null,null,null,"NO"]
[487,null,null,null,"NO"]
[488,null,null,null,"NO"]
[489,null,null,null,"NO"]
[490,null,null,null,"NO"]
[491,null,null,null,"NO"]
[492,null,null,null,"NO"]
[493,null,null,null,"NO"]
[494,null,null,null,"NO"]
[495,null,null,null,"NO"]
[496,null,null,null,"NO"]
[497,null,null,null,"NO"]
[498,null,null,null,"NO"]
[499,null,null,null,"NO"]
[500,null,null,null,"NO"]
[501,null,null,null,"NO"]
[502,null,null,null,"NO"]
[503,null,null,null,"NO"]
[504,null,null,null,"NO"]
[505,null,null,null,"NO"]
[506,null,null,null,"NO"]
[507,null,null,null,"NO"]
[508,null,null,null,"NO"]
[509,null,null,null,"NO"]
[510,null,null,null,"NO"]
[511,null,null,null,"NO"]
[512,null,null,null,"NO"]
[513,null,null,null,{"$f":"+IF(ISERROR(VLOOKUP(B515,COMPRADORES,1,FALSE)),\"NO\",\"SI\")","v":"NO"}]
[514,null,null,null,"NO"]
[515,null,null,null,"NO"]
[516,null,null,null,"NO"]
[517,null,null,null,"NO"]
[518,null,null,null,"NO"]
[519,null,null,null,"NO"]
[520,null,null,null,"NO"]
[521,null,null,null,"NO"]
[522,null,null,null,"NO"]
[523,null,null,null,"NO"]
[524,null,null,null,"NO"]
[525,null,null,null,"NO"]
[526,null,null,null,"NO"]
[527,null,null,null,"NO"]
[528,null,null,null,"NO"]
[529,null,null,null,"NO"]
[530,null,null,null,"NO"]
[531,null,null,null,"NO"]
[532,null,null,null,"NO"]
[533,null,null,null,"NO"]
[534,null,null,null,"NO"]
[535,null,null,null,"NO"]
[536,null,null,null,"NO"]
[537,null,null,null,"NO"]
[538,null,null,null,"NO"]
[539,null,null,null,"NO"]
[540,null,null,null,"NO"]
[541,null,null,null,"NO"]
[542,null,null,null,"NO"]
[543,null,null,null,"NO"]
[544,null,null,null,"NO"]
[545,null,null,null,"NO"]
[546,null,null,null,"NO"]
[547,null,null,null,"NO"]
[548,null,null,null,"NO"]
[549,null,null,null,"NO"]
[550,null,null,null,"NO"]
[551,null,null,null,"NO"]
[552,null,null,null,"NO"]
[553,null,null,null,"NO"]
[554,null,null,null,"NO"]
[555,null,null,null,"NO"]
[556,null,null,null,"NO"]
[557,null,null,null,"NO"]
[558,null,null,null,"NO"]
[559,null,null,null,"NO"]
[560,null,null,null,"NO"]
[561,null,null,null,"NO"]
[562,null,null,null,"NO"]
[563,null,null,null,"NO"]
[564,null,null,null,"NO"]
[565,null,null,null,"NO"]
[566,null,null,null,"NO"]
[567,null,null,null,"NO"]
[568,null,null,null,"NO"]
[569,null,null,null,"NO"]
[570,null,null,null,"NO"]
[571,null,null,null,"NO"]
[572,null,null,null,"NO"]
[573,null,null,null,"NO"]
[574,null,null,null,"NO"]
[575,null,null,null,"NO"]
[576,null,null,null,"NO"]
[577,null,null,null,{"$f":"+IF(ISERROR(VLOOKUP(B579,COMPRADORES,1,FALSE)),\"NO\",\"SI\")","v":"NO"}]
[578,null,null,null,"NO"]
[579,null,null,null,"NO"]
[580,null,null,null,"NO"]
[581,null,null,null,"NO"]
[582,null,null,null,"NO"]
[583,null,null,null,"NO"]
[584,null,null,null,"NO"]
[585,null,null,null,"NO"]
[586,null,null,null,"NO"]
[587,null,null,null,"NO"]
[588,null,null,null,"NO"]
[589,null,null,null,"NO"]
[590,null,null,null,"NO"]
[591,null,null,null,"NO"]
[592,null,null,null,"NO"]
[593,null,null,null,"NO"]
[594,null,null,null,"NO"]
[595,null,null,null,"NO"]
[596,null,null,null,"NO"]
[597,null,null,null,"NO"]
[598,null,null,null,"NO"]
[599,null,null,null,"NO"]
[600,null,null,null,"NO"]
[601,null,null,null,"NO"]
[602,null,null,null,"NO"]
[603,null,null,null,"NO"]
[604,null,null,null,"NO"]
[605,null,null,null,"NO"]
[606,null,null,null,"NO"]
[607,null,null,null,"NO"]
[608,null,null,null,"NO"]
[609,null,null,null,"NO"]
[610,null,null,null,"NO"]
[611,null,null,null,"NO"]
[612,null,null,null,"NO"]
[613,null,null,null,"NO"]
[614,null,null,null,"NO"]
[615,null,null,null,"NO"]
[616,null,null,null,"NO"]
[617,null,null,null,"NO"]
[618,null,null,null,"NO"]
[619,null,null,null,"NO"]
[620,null,null,null,"NO"]
[621,null,null,null,"NO"]
[622,null,null,null,"NO"]
[623,null,null,null,"NO"]
[624,null,null,null,"NO"]
[625,null,null,null,"NO"]
[626,null,null,null,"NO"]
[627,null,null,null,"NO"]
[628,null,null,null,"NO"]
[629,null,null,null,"NO"]
[630,null,null,null,"NO"]
[631,null,null,null,"NO"]
[632,null,null,null,"NO"]
[633,null,null,null,"NO"]
[634,null,null,null,"NO"]
[635,null,null,null,"NO"]
[636,null,null,null,"NO"]
[637,null,null,null,"NO"]
[638,null,null,null,"NO"]
[639,null,null,null,"NO"]
[640,null,null,null,"NO"]
[641,null,null,null,{"$f":"+IF(ISERROR(VLOOKUP(B643,COMPRADORES,1,FALSE)),\"NO\",\"SI\")","v":"NO"}]
[642,null,null,null,"NO"]
[643,null,null,null,"NO"]
[644,null,null,null,"NO"]
[645,null,null,null,"NO"]
[646,null,null,null,"NO"]
[647,null,null,null,"NO"]
[648,null,null,null,"NO"]
[649,null,null,null,"NO"]
[650,null,null,null,"NO"]
[651,null,null,null,"NO"]
[652,null,null,null,"NO"]
[653,null,null,null,"NO"]
[654,null,null,null,"NO"]
[655,null,null,null,"NO"]
[656,null,null,null,"NO"]
[657,null,null,null,"NO"]
[658,null,null,null,"NO"]
[659,null,null,null,"NO"]
[660,null,null,null,"NO"]
[661,null,null,null,"NO"]
[662,null,null,null,"NO"]
[663,null,null,null,"NO"]
[664,null,null,null,"NO"]
[665,null,null,null,"NO"]
[666,null,null,null,"NO"]
[667,null,null,null,"NO"]
[668,null,null,null,"NO"]
[669,null,null,null,"NO"]
[670,null,null,null,"NO"]
[671,null,null,null,"NO"]
[672,null,null,null,"NO"]
[673,null,null,null,"NO"]
[674,null,null,null,"NO"]
[675,null,null,null,"NO"]
[676,null,null,null,"NO"]
[677,null,null,null,"NO"]
[678,null,null,null,"NO"]
[679,null,null,null,"NO"]
[680,null,null,null,"NO"]
[681,null,null,null,"NO"]
[682,null,null,null,"NO"]
[683,null,null,null,"NO"]
[684,null,null,null,"NO"]
[685,null,null,null,"NO"]
[686,null,null,null,"NO"]
[687,null,null,null,"NO"]
[688,null,null,null,"NO"]
[689,null,null,null,"NO"]
[690,null,null,null,"NO"]
[691,null,null,null,"NO"]
[692,null,null,null,"NO"]
[693,null,null,null,"NO"]
[694,null,null,null,"NO"]
[695,null,null,null,"NO"]
[696,null,null,null,"NO"]
[697,null,null,null,"NO"]
[698,null,null,null,"NO"]
[699,null,null,null,"NO"]
[700,null,null,null,"NO"]
[701,null,null,null,"NO"]
[702,null,null,null,"NO"]
[703,null,null,null,"NO"]
[704,null,null,null,"NO"]
[705,null,null,null,{"$f":"+IF(ISERROR(VLOOKUP(B707,COMPRADORES,1,FALSE)),\"NO\",\"SI\")","v":"NO"}]
[706,null,null,null,"NO"]
[707,null,null,null,"NO"]
[708,null,null,null,"NO"]
[709,null,null,null,"NO"]
[710,null,null,null,"NO"]
[711,null,null,null,"NO"]
[712,null,null,null,"NO"]
[713,null,null,null,"NO"]
[714,null,null,null,"NO"]
[715,null,null,null,"NO"]
[716,null,null,null,"NO"]
[717,null,null,null,"NO"]
[718,null,null,null,"NO"]
[719,null,null,null,"NO"]
[720,null,null,null,"NO"]
[721,null,null,null,"NO"]
[722,null,null,null,"NO"]
[723,null,null,null,"NO"]
[724,null,null,null,"NO"]
[725,null,null,null,"NO"]
[726,null,null,null,"NO"]
[727,null,null,null,"NO"]
[728,null,null,null,"NO"]
[729,null,null,null,"NO"]
[730,null,null,null,"NO"]
[731,null,null,null,"NO"]
[732,null,null,null,"NO"]
[733,null,null,null,"NO"]
[734,null,null,null,"NO"]
[735,null,null,null,"NO"]
[736,null,null,null,"NO"]
[737,null,null,null,"NO"]
[738,null,null,null,"NO"]
[739,null,null,null,"NO"]
[740,null,null,null,"NO"]
[741,null,null,null,"NO"]
[742,null,null,null,"NO"]
[743,null,null,null,"NO"]
[744,null,null,null,"NO"]
[745,null,null,null,"NO"]
[746,null,null,null,"NO"]
[747,null,null,null,"NO"]
[748,null,null,null,"NO"]
[749,null,null,null,"NO"]
[750,null,null,null,"NO"]
[751,null,null,null,"NO"]
[752,null,null,null,"NO"]
[753,null,null,null,"NO"]
[754,null,null,null,"NO"]
[755,null,null,null,"NO"]
[756,null,null,null,"NO"]
[757,null,null,null,"NO"]
[758,null,null,null,"NO"]
[759,null,null,null,"NO"]
[760,null,null,null,"NO"]
[761,null,null,null,"NO"]
[762,null,null,null,"NO"]
[763,null,null,null,"NO"]
[764,null,null,null,"NO"]
[765,null,null,null,"NO"]
[766,null,null,null,"NO"]
[767,null,null,null,"NO"]
[768,null,null,null,"NO"]
[769,null,null,null,{"$f":"+IF(ISERROR(VLOOKUP(B771,COMPRADORES,1,FALSE)),\"NO\",\"SI\")","v":"NO"}]
[770,null,null,null,"NO"]
[771,null,null,null,"NO"]
[772,null,null,null,"NO"]
[773,null,null,null,"NO"]
[774,null,null,null,"NO"]
[775,null,null,null,"NO"]
[776,null,null,null,"NO"]
[777,null,null,null,"NO"]
[778,null,null,null,"NO"]
[779,null,null,null,"NO"]
[780,null,null,null,"NO"]
[781,null,null,null,"NO"]
[782,null,null,null,"NO"]
[783,null,null,null,"NO"]
[784,null,null,null,"NO"]
[785,null,null,null,"NO"]
[786,null,null,null,"NO"]
[787,null,null,null,"NO"]
[788,null,null,null,"NO"]
[789,null,null,null,"NO"]
[790,null,null,null,"NO"]
[791,null,null,null,"NO"]
[792,null,null,null,"NO"]
[793,null,null,null,"NO"]
[794,null,null,null,"NO"]
[795,null,null,null,"NO"]
[796,null,null,null,"NO"]
[797,null,null,null,"NO"]
[798,null,null,null,"NO"]
[799,null,null,null,"NO"]
[800,null,null,null,"NO"]
[801,null,null,null,"NO"]
[802,null,null,null,"NO"]
[803,null,null,null,"NO"]
[804,null,null,null,"NO"]
[805,null,null,null,"NO"]
[806,null,null,null,"NO"]
[807,null,null,null,"NO"]
[808,null,null,null,"NO"]
[809,null,null,null,"NO"]
[810,null,null,null,"NO"]
[811,null,null,null,"NO"]
[812,null,null,null,"NO"]
[813,null,null,null,"NO"]
[814,null,null,null,"NO"]
[815,null,null,null,"NO"]
[816,null,null,null,"NO"]
[817,null,null,null,"NO"]
[818,null,null,null,"NO"]
[819,null,null,null,"NO"]
[820,null,null,null,"NO"]
[821,null,null,null,"NO"]
[822,null,null,null,"NO"]
[823,null,null,null,"NO"]
[824,null,null,null,"NO"]
[825,null,null,null,"NO"]
[826,null,null,null,"NO"]
[827,null,null,null,"NO"]
[828,null,null,null,"NO"]
[829,null,null,null,"NO"]
[830,null,null,null,"NO"]
[831,null,null,null,"NO"]
[832,null,null,null,"NO"]
[833,null,null,null,{"$f":"+IF(ISERROR(VLOOKUP(B835,COMPRADORES,1,FALSE)),\"NO\",\"SI\")","v":"NO"}]
[834,null,null,null,"NO"]
[835,null,null,null,"NO"]
[836,null,null,null,"NO"]
[837,null,null,null,"NO"]
[838,null,null,null,"NO"]
[839,null,null,null,"NO"]
[840,null,null,null,"NO"]
[841,null,null,null,"NO"]
[842,null,null,null,"NO"]
[843,null,null,null,"NO"]
[844,null,null,null,"NO"]
[845,null,null,null,"NO"]
[846,null,null,null,"NO"]
[847,null,null,null,"NO"]
[848,null,null,null,"NO"]
[849,null,null,null,"NO"]
[850,null,null,null,"NO"]
[851,null,null,null,"NO"]
[852,null,null,null,"NO"]
[853,null,null,null,"NO"]
[854,null,null,null,"NO"]
[855,null,null,null,"NO"]
[856,null,null,null,"NO"]
[857,null,null,null,"NO"]
[858,null,null,null,"NO"]
[859,null,null,null,"NO"]
[860,null,null,null,"NO"]
[861,null,null,null,"NO"]
[862,null,null,null,"NO"]
[863,null,null,null,"NO"]
[864,null,null,null,"NO"]
[865,null,null,null,"NO"]
[866,null,null,null,"NO"]
[867,null,null,null,"NO"]
[868,null,null,null,"NO"]
[869,null,null,null,"NO"]
[870,null,null,null,"NO"]
[871,null,null,null,"NO"]
[872,null,null,null,"NO"]
[873,null,null,null,"NO"]
[874,null,null,null,"NO"]
[875,null,null,null,"NO"]
[876,null,null,null,"NO"]
[877,null,null,null,"NO"]
[878,null,null,null,"NO"]
[879,null,null,null,"NO"]
[880,null,null,null,"NO"]
[881,null,null,null,"NO"]
[882,null,null,null,"NO"]
[883,null,null,null,"NO"]
[884,null,null,null,"NO"]
[885,null,null,null,"NO"]
[886,null,null,null,"NO"]
[887,null,null,null,"NO"]
[888,null,null,null,"NO"]
[889,null,null,null,"NO"]
[890,null,null,null,"NO"]
[891,null,null,null,"NO"]
[892,null,null,null,"NO"]
[893,null,null,null,"NO"]
[894,null,null,null,"NO"]
[895,null,null,null,"NO"]
[896,null,null,null,"NO"]
[897,null,null,null,{"$f":"+IF(ISERROR(VLOOKUP(B899,COMPRADORES,1,FALSE)),\"NO\",\"SI\")","v":"NO"}]
[898,null,null,null,"NO"]
[899,null,null,null,"NO"]
[900,null,null,null,"NO"]
[901,null,null,null,"NO"]
[902,null,null,null,"NO"]
[903,null,null,null,"NO"]
[904,null,null,null,"NO"]
[905,null,null,null,"NO"]
[906,null,null,null,"NO"]
[907,null,null,null,"NO"]
[908,null,null,null,"NO"]
[909,null,null,null,"NO"]
[910,null,null,null,"NO"]
[911,null,null,null,"NO"]
[912,null,null,null,"NO"]
[913,null,null,null,"NO"]
[914,null,null,null,"NO"]
[915,null,null,null,"NO"]
[916,null,null,null,"NO"]
[917,null,null,null,"NO"]
[918,null,null,null,"NO"]
[919,null,null,null,"NO"]
[920,null,null,null,"NO"]
[921,null,null,null,"NO"]
[922,null,null,null,"NO"]
[923,null,null,null,"NO"]
[924,null,null,null,"NO"]
[925,null,null,null,"NO"]
[926,null,null,null,"NO"]
[927,null,null,null,"NO"]
[928,null,null,null,"NO"]
[929,null,null,null,"NO"]
[930,null,null,null,"NO"]
[931,null,null,null,"NO"]
[932,null,null,null,"NO"]
[933,null,null,null,"NO"]
[934,null,null,null,"NO"]
[935,null,null,null,"NO"]
[936,null,null,null,"NO"]
[937,null,null,null,"NO"]
[938,null,null,null,"NO"]
[939,null,null,null,"NO"]
[940,null,null,null,"NO"]
[941,null,null,null,"NO"]
[942,null,null,null,"NO"]
[943,null,null,null,"NO"]
[944,null,null,null,"NO"]
[945,null,null,null,"NO"]
[946,null,null,null,"NO"]
[947,null,null,null,"NO"]
[948,null,null,null,"NO"]
[949,null,null,null,"NO"]
[950,null,null,null,"NO"]
[951,null,null,null,"NO"]
[952,null,null,null,"NO"]
[953,null,null,null,"NO"]
[954,null,null,null,"NO"]
[955,null,null,null,"NO"]
[956,null,null,null,"NO"]
[957,null,null,null,"NO"]
[958,null,null,null,"NO"]
[959,null,null,null,"NO"]
[960,null,null,null,"NO"]
[961,null,null,null,{"$f":"+IF(ISERROR(VLOOKUP(B963,COMPRADORES,1,FALSE)),\"NO\",\"SI\")","v":"NO"}]
[962,null,null,null,"NO"]
[963,null,null,null,"NO"]
[964,null,null,null,"NO"]
[965,null,null,null,"NO"]
[966,null,null,null,"NO"]
[967,null,null,null,"NO"]
[968,null,null,null,"NO"]
[969,null,null,null,"NO"]
[970,null,null,null,"NO"]
[971,null,null,null,"NO"]
[972,null,null,null,"NO"]
[973,null,null,null,"NO"]
[974,null,null,null,"NO"]
[975,null,null,null,"NO"]
[976,null,null,null,"NO"]
[977,null,null,null,"NO"]
[978,null,null,null,"NO"]
[979,null,null,null,"NO"]
[980,null,null,null,"NO"]
[981,null,null,null,"NO"]
[982,null,null,null,"NO"]
[983,null,null,null,"NO"]
[984,null,null,null,"NO"]
[985,null,null,null,"NO"]
[986,null,null,null,"NO"]
[987,null,null,null,"NO"]
[988,null,null,null,"NO"]
[989,null,null,null,"NO"]
[990,null,null,null,"NO"]
[991,null,null,null,"NO"]
[992,null,null,null,"NO"]
[993,null,null,null,"NO"]
[994,null,null,null,"NO"]
[995,null,null,null,"NO"]
[996,null,null,null,"NO"]
[997,null,null,null,"NO"]
[998,null,null,null,"NO"]
[999,null,null,null,"NO"]
[1000,null,null,null,"NO"]

{"sheet":"OFERTA INICIAL","index":3,"n_rows":25,"n_cols":4,"rows_kept":25,"cut":false,"hidden":false,"merged":[]}
[]
[null,"Precio de inicio",{"$f":"+'DEMANDA REGULADA'!F5","v":0},"$/kWh"]
[]
["ID","VENDEDORES","OFERTA INICIAL"]
[1,{"$f":"+IF(INDEX(VENDEDORES,A5)=\"\",\"\",INDEX(VENDEDORES,A5))","v":""},null,{"$f":"+PARTICIPANTES!B3","v":0}]
[2,"",null,{"$f":"+PARTICIPANTES!B4","v":0}]
[3,"",null,{"$f":"+PARTICIPANTES!B5","v":0}]
[4,"",null,{"$f":"+PARTICIPANTES!B6","v":0}]
[5,"",null,{"$f":"+PARTICIPANTES!B7","v":0}]
[6,"",null,{"$f":"+PARTICIPANTES!B8","v":0}]
[7,"",null,{"$f":"+PARTICIPANTES!B9","v":0}]
[8,"",null,{"$f":"+PARTICIPANTES!B10","v":0}]
[9,"",null,{"$f":"+PARTICIPANTES!B11","v":0}]
[10,"",null,{"$f":"+PARTICIPANTES!B12","v":0}]
[11,"",null,{"$f":"+PARTICIPANTES!B13","v":0}]
[12,"",null,{"$f":"+PARTICIPANTES!B14","v":0}]
[13,"",null,{"$f":"+PARTICIPANTES!B15","v":0}]
[14,"",null,{"$f":"+PARTICIPANTES!B16","v":0}]
[15,"",null,{"$f":"+PARTICIPANTES!B17","v":0}]
[16,"",null,{"$f":"+PARTICIPANTES!B18","v":0}]
[17,"",null,{"$f":"+PARTICIPANTES!B19","v":0}]
[18,"",null,{"$f":"+PARTICIPANTES!B20","v":0}]
[19,"",null,{"$f":"+PARTICIPANTES!B21","v":0}]
[20,"",null,{"$f":"+PARTICIPANTES!B22","v":0}]
[null,"TOTAL",{"$f":"+SUM(C5:C24)","v":0}]

{"sheet":"SUBASTADOR","index":4,"n_rows":33,"n_cols":9,"rows_kept":33,"cut":false,"hidden":false,"merged":[[32,0,32,2],[15,0,15,2],[3,0,3,3],[16,0,16,2],[18,0,18,2],[29,0,29,3],[19,0,19,2],[27,0,27,2],[4,0,4,2],[5,0,5,2],[8,0,8,2],[6,0,6,2],[13,0,13,2],[14,0,14,2],[11,0,11,2],[12,0,12,2],[24,0,24,2],[25,0,25,2],[30,0,30,2],[31,0,31,2],[26,0,26,2],[3,5,3,6],[7,0,7,3],[17,0,17,3],[9,0,9,2],[23,0,23,2],[21,0,21,2],[22,0,22,2],[4,5,4,6],[5,5,5,6],[20,0,20,2],[10,0,10,2],[6,5,6,6],[7,5,7,6],[8,5,8,6],[9,5,9,6]]}
[]
[]
[]
["RONDA ANTERIOR",null,null,null,null,"Precio inicio Subasta",null,{"$f":"+PRECIO_INICIAL","v":0},"$/kWh"]
["Ronda número:",null,null,{"$f":"+MAX(RONDAS!$A$3:$A$52)","v":0},null,"Oferta Inicial Agregada",null,{"$f":"+'OFERTA INICIAL'!C25","v":0}]
["Precio de inicio",null,null,{"$f":"+INDEX(RONDAS,RONDA_ACTUAL,2)","v":0},null,"Demanda R + NR en el precio pp1",null,0]
["Precio de finalización",null,null,{"$f":"+IF(RONDA_ACTUAL=0,H4,INDEX(RONDAS,RONDA_ACTUAL,3))","v":0},null,"Precio de cierre R",null,null,"$/kWh"]
["VARIABLES AL PRECIO DE INICIO",null,null,null,null,"Precio de cierre NR",null,null,"$/kWh"]
["Margen de preferencia de la oferta (MPO)",null,null,{"$f":"+INDEX(RONDAS,RONDA_ACTUAL,4)","v":0},null,"Ventas R",null,{"$f":"+ASIGNACIONES!C3","v":0}]
["Precio del producto - DNR",null,null,{"$f":"+INDEX(RONDAS,RONDA_ACTUAL,5)","v":0},null,"Ventas NR",null,{"$f":"+ASIGNACIONES!C4","v":0}]
["Oferta agregada",null,null,{"$f":"+IF(RONDA_ACTUAL=1,H5,INDEX(RONDAS,RONDA_ACTUAL,6))","v":0}]
["DR",null,null,{"$f":"+INDEX(RONDAS,RONDA_ACTUAL,7)","v":0}]
["DNR",null,null,{"$f":"+INDEX(RONDAS,RONDA_ACTUAL,8)","v":0}]
["Exceso de oferta - DR",null,null,{"$f":"+INDEX(RONDAS,RONDA_ACTUAL,9)","v":0}]
["Exceso de oferta - DNR",null,null,{"$f":"+INDEX(RONDAS,RONDA_ACTUAL,10)","v":0}]
["Exceso de oferta porcentual - DR",null,null,{"$f":"+INDEX(RONDAS,RONDA_ACTUAL,11)","v":0}]
["Exceso de oferta porcentual- DNR",null,null,{"$f":"+INDEX(RONDAS,RONDA_ACTUAL,12)","v":0}]
["VARIABLES AL PRECIO DE FINALIZACIÓN"]
["Margen de preferencia de la oferta (MPO)",null,null,{"$f":"+INDEX(RONDAS,RONDA_ACTUAL,13)","v":0}]
["Precio del producto - DNR",null,null,{"$f":"+INDEX(RONDAS,RONDA_ACTUAL,14)","v":0}]
["Oferta agregada",null,null,{"$f":"+INDEX(RONDAS,RONDA_ACTUAL,15)","v":0}]
["DR",null,null,{"$f":"+INDEX(RONDAS,RONDA_ACTUAL,16)","v":0}]
["DNR",null,null,{"$f":"+INDEX(RONDAS,RONDA_ACTUAL,17)","v":0}]
["Exceso de oferta - DR",null,null,{"$f":"+INDEX(RONDAS,RONDA_ACTUAL,18)","v":0}]
["Exceso de oferta - DNR",null,null,{"$f":"+INDEX(RONDAS,RONDA_ACTUAL,19)","v":0}]
["Exceso de oferta porcentual - DR",null,null,{"$f":"+INDEX(RONDAS,RONDA_ACTUAL,20)","v":0}]
["Exceso de oferta porcentual- DNR",null,null,{"$f":"+INDEX(RONDAS,RONDA_ACTUAL,21)","v":0}]
["Última ronda?",null,null,{"$f":"+INDEX(RONDAS,RONDA_ACTUAL,22)","v":0}]
[]
["PROXIMA RONDA"]
["Ronda número:",null,null,{"$f":"+D5+1","v":1}]
["Precio de inicio de la ronda",null,null,{"$f":"+D7","v":0}]
["Precio de finalización de la ronda"]

{"sheet":"OFERTAS","index":5,"n_rows":81,"n_cols":24,"rows_kept":81,"cut":false,"hidden":false,"merged":[[8,1,8,2],[5,1,5,3],[67,2,68,2],[67,3,68,3],[1,1,1,3],[52,2,53,2],[52,3,53,3],[16,2,17,2],[16,3,17,3],[2,1,2,2],[3,1,3,2],[4,1,4,2],[6,1,6,2],[7,1,7,2],[40,4,40,13],[40,14,40,23],[11,2,11,3],[10,2,10,3],[14,5,14,6]]}
[]
[null,"RONDA"]
[null,"Ronda número:",null,{"$f":"+RONDA_ACTUAL","v":0}]
[null,"Precio de inicio de la ronda",null,{"$f":"+SUBASTADOR!D6","v":0},null,"$/kWh"]
[null,"Precio de finalización de la ronda",null,{"$f":"+SUBASTADOR!D7","v":0},null,"$/kWh"]
[null,"VARIABLES AL PRECIO DE INICIO"]
[null,"MPO",null,{"$f":"+SUBASTADOR!D9","v":0},null,"$/kWh"]
[null,"Precio del producto - DNR",null,{"$f":"+SUBASTADOR!D10","v":0},null,"$/kWh"]
[null,"Oferta agregada",null,{"$f":"+SUBASTADOR!D11","v":0}]
[]
[null,"ID",1]
[null,"NOMBRE",{"$f":"+INDEX(VENDEDORES,C11)","v":0}]
[]
[null,"MPR",null,"$/kWh"]
[null,"MPNR",null,"$/kWh",null,"PARAMETROS GRÁFICA"]
[null,null,null,null,null,"Punto"]
[null,null,"Precio          ($/kWh)","Cantidad",null,"Precio R",{"$f":"+INDEX($C$20:$C$24,D39)","v":0}]
[null,null,null,null,null,"Cantidad",{"$f":"+INDEX($D$20:$D$24,D39)","v":0}]
[null,0,{"$f":"+D4","v":0},0,null,"MPO max",10]
[null,1,null,null,null,"MPO min",-10]
[null,2]
[null,3]
[null,4]
[null,5]
[null,6,{"$f":"+D5","v":0},{"$f":"+MIN(D19:D24)","v":0}]
[]
[]
[]
[]
[]
[]
[]
[]
[]
[]
[]
[]
[]
[null,null,null,1,{"$f":"+INDEX(E43:E47,$D$39)","v":{"$error":"#VALUE!"}},{"$f":"+INDEX(F43:F47,$D$39)","v":{"$error":"#VALUE!"}},{"$error":"#VALUE!"},{"$error":"#VALUE!"},{"$error":"#VALUE!"},{"$error":"#VALUE!"},{"$error":"#VALUE!"},{"$error":"#VALUE!"},{"$error":"#VALUE!"},{"$error":"#VALUE!"},{"$f":"+INDEX(O43:O47,$D$39)","v":{"$error":"#VALUE!"}},{"$f":"+INDEX(P43:P47,$D$39)","v":{"$error":"#VALUE!"}},{"$error":"#VALUE!"},{"$error":"#VALUE!"},{"$error":"#VALUE!"},{"$error":"#VALUE!"},{"$error":"#VALUE!"},{"$error":"#VALUE!"},{"$error":"#VALUE!"},{"$error":"#VALUE!"}]
[]
[null,null,null,null,"REGULADO",null,null,null,null,null,null,null,null,null,"NO REGULADO"]
[null,null,"Precio          ($/kWh)","Cantidad","G1","G2","G3","G4","G5","G6","G7","G8","G9","G10","G1","G2","G3","G4","G5","G6","G7","G8","G9","G10"]
[null,1,{"$f":"+IF(C20<>\"\",C20,\"\")","v":""},{"$f":"+IF(D20<>\"\",D20,\"\")","v":""},{"$f":"+IF(E$48>=$C$14,1,IF(E$48<$C$15,0,(E$48-$C$15)/($C$14-$C$15)))*$D43","v":{"$error":"#VALUE!"}},{"$f":"+IF(F$48>=$C$14,1,IF(F$48<$C$15,0,(F$48-$C$15)/($C$14-$C$15)))*$D43","v":{"$error":"#VALUE!"}},{"$error":"#VALUE!"},{"$error":"#VALUE!"},{"$error":"#VALUE!"},{"$error":"#VALUE!"},{"$error":"#VALUE!"},{"$error":"#VALUE!"},{"$error":"#VALUE!"},{"$error":"#VALUE!"},{"$f":"+$D43-E43","v":{"$error":"#VALUE!"}},{"$f":"+$D43-F43","v":{"$error":"#VALUE!"}},{"$error":"#VALUE!"},{"$error":"#VALUE!"},{"$error":"#VALUE!"},{"$f":"+$D43-J43","v":{"$error":"#VALUE!"}},{"$f":"+$D43-K43","v":{"$error":"#VALUE!"}},{"$f":"+$D43-L43","v":{"$error":"#VALUE!"}},{"$f":"+$D43-M43","v":{"$error":"#VALUE!"}},{"$f":"+$D43-N43","v":{"$error":"#VALUE!"}}]
[null,2,{"$f":"+IF(C21<>\"\",C21,\"\")","v":""},"",{"$f":"+IF(E$48>=$C$14,1,IF(E$48<$C$15,0,(E$48-$C$15)/($C$14-$C$15)))*$D44","v":{"$error":"#VALUE!"}},{"$error":"#VALUE!"},{"$error":"#VALUE!"},{"$error":"#VALUE!"},{"$error":"#VALUE!"},{"$error":"#VALUE!"},{"$error":"#VALUE!"},{"$error":"#VALUE!"},{"$error":"#VALUE!"},{"$error":"#VALUE!"},{"$f":"+$D44-E44","v":{"$error":"#VALUE!"}},{"$f":"+$D44-F44","v":{"$error":"#VALUE!"}},{"$f":"+$D44-G44","v":{"$error":"#VALUE!"}},{"$f":"+$D44-H44","v":{"$error":"#VALUE!"}},{"$f":"+$D44-I44","v":{"$error":"#VALUE!"}},{"$f":"+$D44-J44","v":{"$error":"#VALUE!"}},{"$f":"+$D44-K44","v":{"$error":"#VALUE!"}},{"$f":"+$D44-L44","v":{"$error":"#VALUE!"}},{"$f":"+$D44-M44","v":{"$error":"#VALUE!"}},{"$f":"+$D44-N44","v":{"$error":"#VALUE!"}}]
[null,3,{"$f":"+IF(C22<>\"\",C22,\"\")","v":""},"",{"$error":"#VALUE!"},{"$error":"#VALUE!"},{"$error":"#VALUE!"},{"$error":"#VALUE!"},{"$error":"#VALUE!"},{"$error":"#VALUE!"},{"$error":"#VALUE!"},{"$error":"#VALUE!"},{"$error":"#VALUE!"},{"$error":"#VALUE!"},{"$error":"#VALUE!"},{"$error":"#VALUE!"},{"$error":"#VALUE!"},{"$error":"#VALUE!"},{"$error":"#VALUE!"},{"$error":"#VALUE!"},{"$error":"#VALUE!"},{"$error":"#VALUE!"},{"$error":"#VALUE!"},{"$error":"#VALUE!"}]
[null,4,{"$f":"+IF(C23<>\"\",C23,\"\")","v":""},"",{"$error":"#VALUE!"},{"$error":"#VALUE!"},{"$error":"#VALUE!"},{"$error":"#VALUE!"},{"$error":"#VALUE!"},{"$error":"#VALUE!"},{"$error":"#VALUE!"},{"$error":"#VALUE!"},{"$error":"#VALUE!"},{"$error":"#VALUE!"},{"$error":"#VALUE!"},{"$error":"#VALUE!"},{"$error":"#VALUE!"},{"$error":"#VALUE!"},{"$error":"#VALUE!"},{"$error":"#VALUE!"},{"$error":"#VALUE!"},{"$error":"#VALUE!"},{"$error":"#VALUE!"},{"$error":"#VALUE!"}]
[null,5,{"$f":"+IF(C24<>\"\",C24,\"\")","v":""},"",{"$error":"#VALUE!"},{"$error":"#VALUE!"},{"$error":"#VALUE!"},{"$error":"#VALUE!"},{"$error":"#VALUE!"},{"$error":"#VALUE!"},{"$error":"#VALUE!"},{"$error":"#VALUE!"},{"$error":"#VALUE!"},{"$error":"#VALUE!"},{"$error":"#VALUE!"},{"$error":"#VALUE!"},{"$error":"#VALUE!"},{"$error":"#VALUE!"},{"$error":"#VALUE!"},{"$error":"#VALUE!"},{"$error":"#VALUE!"},{"$error":"#VALUE!"},{"$error":"#VALUE!"},{"$error":"#VALUE!"}]
[null,null,null,"MPO",{"$f":"+G19","v":10},{"$f":"+(($E$48-$N$48)/9)*8+$N$48","v":7.7777777777777786},{"$f":"+(($E$48-$N$48)/9)*7+$N$48","v":5.5555555555555571},{"$f":"+(($E$48-$N$48)/9)*6+$N$48","v":3.3333333333333339},{"$f":"+(($E$48-$N$48)/9)*5+$N$48","v":1.1111111111111107},{"$f":"+(($E$48-$N$48)/9)*4+$N$48","v":-1.1111111111111107},{"$f":"+(($E$48-$N$48)/9)*3+$N$48","v":-3.333333333333333},{"$f":"+(($E$48-$N$48)/9)*2+$N$48","v":-5.5555555555555554},{"$f":"+(($E$48-$N$48)/9)+$N$48","v":-7.7777777777777777},{"$f":"+G20","v":-10}]
[null,null,null,"PNR",{"$f":"+$G$17-E48","v":-10},{"$f":"+$G$17-F48","v":-7.7777777777777786},{"$f":"+$G$17-G48","v":-5.5555555555555571},-3.3333333333333339,-1.1111111111111107,1.1111111111111107,3.333333333333333,5.5555555555555554,7.7777777777777777,10]
[null,null,null,null,{"$f":"+E48","v":10},{"$f":"+F48","v":7.7777777777777786},5.5555555555555571,3.3333333333333339,1.1111111111111107,-1.1111111111111107,-3.333333333333333,-5.5555555555555554,-7.7777777777777777,-10]
[]
[]
[null,null,"Precio          ($/kWh)","Cantidad"]
[]
[null,0,{"$f":"+IF(C19=\"\",\"\",C19)","v":0},{"$f":"+D19","v":0}]
[null,"0'",{"$f":"+C57+0.001","v":1E-3},{"$f":"+D55","v":0}]
[null,1,{"$f":"+C20","v":0},{"$f":"+D20","v":0}]
[null,"1'",{"$f":"+C59+0.001","v":1E-3},{"$f":"+D57","v":0}]
[null,2,{"$f":"+C21","v":0},{"$f":"+D21","v":0}]
[null,"2'",{"$f":"+C61+0.001","v":1E-3},{"$f":"+D59","v":0}]
[null,3,{"$f":"+C22","v":0},{"$f":"+D22","v":0}]
[null,"3'",{"$f":"+C63+0.001","v":1E-3},{"$f":"+D61","v":0}]
[null,4,{"$f":"+C23","v":0},{"$f":"+D23","v":0}]
[null,"4'",{"$f":"+C65+0.001","v":1E-3},{"$f":"+D63","v":0}]
[null,5,{"$f":"+C24","v":0},{"$f":"+D24","v":0}]
[null,6,{"$f":"+C25","v":0},{"$f":"+D25","v":0}]
[]
[null,null,"Precio          ($/kWh)","Cantidad"]
[]
[null,0,{"$f":"+C55","v":0},{"$f":"+D55","v":0}]
[null,"0'",{"$f":"+MAX(C56:$C$66)","v":1E-3},{"$f":"+MAX(D56:$D$66)","v":0}]
[null,1,{"$f":"+MAX(C57,C57:$C$66)","v":1E-3},{"$f":"+MAX(D57:$D$66)","v":0}]
[null,"1'",{"$f":"+MAX(C58,C58:$C$66)","v":1E-3},{"$f":"+MAX(D58:$D$66)","v":0}]
[null,2,{"$f":"+MAX(C59,C59:$C$66)","v":1E-3},{"$f":"+MAX(D59:$D$66)","v":0}]
[null,"2'",{"$f":"+MAX(C60,C60:$C$66)","v":1E-3},{"$f":"+MAX(D60:$D$66)","v":0}]
[null,3,{"$f":"+MAX(C61,C61:$C$66)","v":1E-3},{"$f":"+MAX(D61:$D$66)","v":0}]
[null,"3'",{"$f":"+MAX(C62,C62:$C$66)","v":1E-3},{"$f":"+MAX(D62:$D$66)","v":0}]
[null,4,{"$f":"+MAX(C63,C63:$C$66)","v":1E-3},{"$f":"+MAX(D63:$D$66)","v":0}]
[null,"4'",{"$f":"+MAX(C64,C64:$C$66)","v":1E-3},{"$f":"+MAX(D64:$D$66)","v":0}]
[null,5,{"$f":"+MAX(C65,C65:$C$66)","v":0},{"$f":"+MAX(D65:$D$66)","v":0}]
[null,6,{"$f":"+MAX(C66,C66:$C$66)","v":0},{"$f":"+MAX(D66:$D$66)","v":0}]

{"sheet":"ASIGNACIONES","index":6,"n_rows":26,"n_cols":8,"rows_kept":26,"cut":false,"hidden":false,"merged":[[0,0,0,1],[1,0,1,1],[2,0,2,1],[3,0,3,1]]}
["Precio de cierre R",null,{"$f":"+P_CIERRE","v":0}]
["Precio de cierre NR",null,{"$f":"+SUBASTADOR!H8","v":0}]
["Ventas R",null,{"$f":"+SUM(C7:C26)","v":0}]
["Ventas NR",null,{"$f":"+SUM(D7:D26)","v":0}]
[]
["ID","VENDEDORES","VENTAS R","VENTAS NR",null,"ID","COMPRADORES DNR","COMPRAS"]
[1,{"$f":"+IF(INDEX(VENDEDORES,A7)<>\"\",INDEX(VENDEDORES,A7),\"\")","v":""},null,null,null,1,{"$f":"+IF(INDEX(COMPRADORES,A7)<>\"\",INDEX(COMPRADORES,A7),\"\")","v":""}]
[2,"",null,null,null,2,""]
[3,"",null,null,null,3,""]
[4,"",null,null,null,4,""]
[5,"",null,null,null,5,""]
[6,"",null,null,null,6,""]
[7,"",null,null,null,7,""]
[8,"",null,null,null,8,""]
[9,"",null,null,null,9,""]
[10,"",null,null,null,10,""]
[11,"",null,null,null,11,""]
[12,"",null,null,null,12,""]
[13,"",null,null,null,13,""]
[14,"",null,null,null,14,""]
[15,"",null,null,null,15,""]
[16,"",null,null,null,16,""]
[17,"",null,null,null,17,""]
[18,"",null,null,null,18,""]
[19,"",null,null,null,19,""]
[20,"",null,null,null,20,""]

{"sheet":"OFERTA ACUMULADA","index":7,"n_rows":1003,"n_cols":13,"rows_kept":1003,"cut":false,"hidden":false,"merged":[[1,1,1,4],[1,6,1,9],[1,11,1,12]]}
[]
[null,"CURVA DE OFERTA POR AGENTE",null,null,null,null,"PREFERENCIAS ENTRE PRODUCTOS",null,null,null,null,"CURVA AGREGADA"]
["ID","AGENTE","PRECIO     ($/kWh)","NUM PRODUCTOS","RONDA",null,"AGENTE","MPR","MPNR","RONDA",null,"PRECIO     ($/kWh)","NUM PRODUCTOS"]
[1]
[2]
[3]
[4]
[5]
[6]
[7]
[8]
[9]
[10]
[11]
[12]
[13]
[14]
[15]
[16]
[17]
[18]
[19]
[20]
[21]
[22]
[23]
[24]
[25]
[26]
[27]
[28]
[29]
[30]
[31]
[32]
[33]
[34]
[35]
[36]
[37]
[38]
[39]
[40]
[41]
[42]
[43]
[44]
[45]
[46]
[47]
[48]
[49]
[50]
[51]
[52]
[53]
[54]
[55]
[56]
[57]
[58]
[59]
[60]
[61]
[62]
[63]
[64]
[65]
[66]
[67]
[68]
[69]
[70]
[71]
[72]
[73]
[74]
[75]
[76]
[77]
[78]
[79]
[80]
[81]
[82]
[83]
[84]
[85]
[86]
[87]
[88]
[89]
[90]
[91]
[92]
[93]
[94]
[95]
[96]
[97]
[98]
[99]
[100]
[101]
[102]
[103]
[104]
[105]
[106]
[107]
[108]
[109]
[110]
[111]
[112]
[113]
[114]
[115]
[116]
[117]
[118]
[119]
[120]
[121]
[122]
[123]
[124]
[125]
[126]
[127]
[128]
[129]
[130]
[131]
[132]
[133]
[134]
[135]
[136]
[137]
[138]
[139]
[140]
[141]
[142]
[143]
[144]
[145]
[146]
[147]
[148]
[149]
[150]
[151]
[152]
[153]
[154]
[155]
[156]
[157]
[158]
[159]
[160]
[161]
[162]
[163]
[164]
[165]
[166]
[167]
[168]
[169]
[170]
[171]
[172]
[173]
[174]
[175]
[176]
[177]
[178]
[179]
[180]
[181]
[182]
[183]
[184]
[185]
[186]
[187]
[188]
[189]
[190]
[191]
[192]
[193]
[194]
[195]
[196]
[197]
[198]
[199]
[200]
[201]
[202]
[203]
[204]
[205]
[206]
[207]
[208]
[209]
[210]
[211]
[212]
[213]
[214]
[215]
[216]
[217]
[218]
[219]
[220]
[221]
[222]
[223]
[224]
[225]
[226]
[227]
[228]
[229]
[230]
[231]
[232]
[233]
[234]
[235]
[236]
[237]
[238]
[239]
[240]
[241]
[242]
[243]
[244]
[245]
[246]
[247]
[248]
[249]
[250]
[251]
[252]
[253]
[254]
[255]
[256]
[257]
[258]
[259]
[260]
[261]
[262]
[263]
[264]
[265]
[266]
[267]
[268]
[269]
[270]
[271]
[272]
[273]
[274]
[275]
[276]
[277]
[278]
[279]
[280]
[281]
[282]
[283]
[284]
[285]
[286]
[287]
[288]
[289]
[290]
[291]
[292]
[293]
[294]
[295]
[296]
[297]
[298]
[299]
[300]
[301]
[302]
[303]
[304]
[305]
[306]
[307]
[308]
[309]
[310]
[311]
[312]
[313]
[314]
[315]
[316]
[317]
[318]
[319]
[320]
[321]
[322]
[323]
[324]
[325]
[326]
[327]
[328]
[329]
[330]
[331]
[332]
[333]
[334]
[335]
[336]
[337]
[338]
[339]
[340]
[341]
[342]
[343]
[344]
[345]
[346]
[347]
[348]
[349]
[350]
[351]
[352]
[353]
[354]
[355]
[356]
[357]
[358]
[359]
[360]
[361]
[362]
[363]
[364]
[365]
[366]
[367]
[368]
[369]
[370]
[371]
[372]
[373]
[374]
[375]
[376]
[377]
[378]
[379]
[380]
[381]
[382]
[383]
[384]
[385]
[386]
[387]
[388]
[389]
[390]
[391]
[392]
[393]
[394]
[395]
[396]
[397]
[398]
[399]
[400]
[401]
[402]
[403]
[404]
[405]
[406]
[407]
[408]
[409]
[410]
[411]
[412]
[413]
[414]
[415]
[416]
[417]
[418]
[419]
[420]
[421]
[422]
[423]
[424]
[425]
[426]
[427]
[428]
[429]
[430]
[431]
[432]
[433]
[434]
[435]
[436]
[437]
[438]
[439]
[440]
[441]
[442]
[443]
[444]
[445]
[446]
[447]
[448]
[449]
[450]
[451]
[452]
[453]
[454]
[455]
[456]
[457]
[458]
[459]
[460]
[461]
[462]
[463]
[464]
[465]
[466]
[467]
[468]
[469]
[470]
[471]
[472]
[473]
[474]
[475]
[476]
[477]
[478]
[479]
[480]
[481]
[482]
[483]
[484]
[485]
[486]
[487]
[488]
[489]
[490]
[491]
[492]
[493]
[494]
[495]
[496]
[497]
[498]
[499]
[500]
[501]
[502]
[503]
[504]
[505]
[506]
[507]
[508]
[509]
[510]
[511]
[512]
[513]
[514]
[515]
[516]
[517]
[518]
[519]
[520]
[521]
[522]
[523]
[524]
[525]
[526]
[527]
[528]
[529]
[530]
[531]
[532]
[533]
[534]
[535]
[536]
[537]
[538]
[539]
[540]
[541]
[542]
[543]
[544]
[545]
[546]
[547]
[548]
[549]
[550]
[551]
[552]
[553]
[554]
[555]
[556]
[557]
[558]
[559]
[560]
[561]
[562]
[563]
[564]
[565]
[566]
[567]
[568]
[569]
[570]
[571]
[572]
[573]
[574]
[575]
[576]
[577]
[578]
[579]
[580]
[581]
[582]
[583]
[584]
[585]
[586]
[587]
[588]
[589]
[590]
[591]
[592]
[593]
[594]
[595]
[596]
[597]
[598]
[599]
[600]
[601]
[602]
[603]
[604]
[605]
[606]
[607]
[608]
[609]
[610]
[611]
[612]
[613]
[614]
[615]
[616]
[617]
[618]
[619]
[620]
[621]
[622]
[623]
[624]
[625]
[626]
[627]
[628]
[629]
[630]
[631]
[632]
[633]
[634]
[635]
[636]
[637]
[638]
[639]
[640]
[641]
[642]
[643]
[644]
[645]
[646]
[647]
[648]
[649]
[650]
[651]
[652]
[653]
[654]
[655]
[656]
[657]
[658]
[659]
[660]
[661]
[662]
[663]
[664]
[665]
[666]
[667]
[668]
[669]
[670]
[671]
[672]
[673]
[674]
[675]
[676]
[677]
[678]
[679]
[680]
[681]
[682]
[683]
[684]
[685]
[686]
[687]
[688]
[689]
[690]
[691]
[692]
[693]
[694]
[695]
[696]
[697]
[698]
[699]
[700]
[701]
[702]
[703]
[704]
[705]
[706]
[707]
[708]
[709]
[710]
[711]
[712]
[713]
[714]
[715]
[716]
[717]
[718]
[719]
[720]
[721]
[722]
[723]
[724]
[725]
[726]
[727]
[728]
[729]
[730]
[731]
[732]
[733]
[734]
[735]
[736]
[737]
[738]
[739]
[740]
[741]
[742]
[743]
[744]
[745]
[746]
[747]
[748]
[749]
[750]
[751]
[752]
[753]
[754]
[755]
[756]
[757]
[758]
[759]
[760]
[761]
[762]
[763]
[764]
[765]
[766]
[767]
[768]
[769]
[770]
[771]
[772]
[773]
[774]
[775]
[776]
[777]
[778]
[779]
[780]
[781]
[782]
[783]
[784]
[785]
[786]
[787]
[788]
[789]
[790]
[791]
[792]
[793]
[794]
[795]
[796]
[797]
[798]
[799]
[800]
[801]
[802]
[803]
[804]
[805]
[806]
[807]
[808]
[809]
[810]
[811]
[812]
[813]
[814]
[815]
[816]
[817]
[818]
[819]
[820]
[821]
[822]
[823]
[824]
[825]
[826]
[827]
[828]
[829]
[830]
[831]
[832]
[833]
[834]
[835]
[836]
[837]
[838]
[839]
[840]
[841]
[842]
[843]
[844]
[845]
[846]
[847]
[848]
[849]
[850]
[851]
[852]
[853]
[854]
[855]
[856]
[857]
[858]
[859]
[860]
[861]
[862]
[863]
[864]
[865]
[866]
[867]
[868]
[869]
[870]
[871]
[872]
[873]
[874]
[875]
[876]
[877]
[878]
[879]
[880]
[881]
[882]
[883]
[884]
[885]
[886]
[887]
[888]
[889]
[890]
[891]
[892]
[893]
[894]
[895]
[896]
[897]
[898]
[899]
[900]
[901]
[902]
[903]
[904]
[905]
[906]
[907]
[908]
[909]
[910]
[911]
[912]
[913]
[914]
[915]
[916]
[917]
[918]
[919]
[920]
[921]
[922]
[923]
[924]
[925]
[926]
[927]
[928]
[929]
[930]
[931]
[932]
[933]
[934]
[935]
[936]
[937]
[938]
[939]
[940]
[941]
[942]
[943]
[944]
[945]
[946]
[947]
[948]
[949]
[950]
[951]
[952]
[953]
[954]
[955]
[956]
[957]
[958]
[959]
[960]
[961]
[962]
[963]
[964]
[965]
[966]
[967]
[968]
[969]
[970]
[971]
[972]
[973]
[974]
[975]
[976]
[977]
[978]
[979]
[980]
[981]
[982]
[983]
[984]
[985]
[986]
[987]
[988]
[989]
[990]
[991]
[992]
[993]
[994]
[995]
[996]
[997]
[998]
[999]
[1000]

{"sheet":"RONDAS","index":8,"n_rows":52,"n_cols":24,"rows_kept":52,"cut":false,"hidden":false,"merged":[[0,3,0,11],[0,12,0,21],[0,22,0,23]]}
[null,null,null,"VARIABLES AL PRECIO DE INICIO",null,null,null,null,null,null,null,null,"VARIABLES AL PRECIO DE FINALIZACIÓN",null,null,null,null,null,null,null,null,null,"GRÁFICA"]
["ID","Precio de inicio de la ronda","Precio de finalización de la ronda","MPO","Precio del producto - DNR","Oferta agregada","DR","DNR","Exceso de oferta - DR","Exceso de oferta - DNR","Exceso de oferta porcentual - DR","Exceso de oferta porcentual- DNR","MPO","Precio del producto - DNR","Oferta agregada","DR","DNR","Exceso de oferta - DR","Exceso de oferta - DNR","Exceso de oferta porcentual - DR","Exceso de oferta porcentual- DNR","Última ronda?","OFERTA R","OFERTANR"]
[null,null,null,null,null,null,null,null,null,null,null,null,null,null,null,null,null,null,null,null,null,null,{"$f":"+R3+P3","v":0},{"$f":"+S3+Q3","v":0}]
[null,null,null,null,null,null,null,null,null,null,null,null,null,null,null,null,null,null,null,null,null,null,{"$f":"+R4+P4","v":0},{"$f":"+S4+Q4","v":0}]
[null,null,null,null,null,null,null,null,null,null,null,null,null,null,null,null,null,null,null,null,null,null,0,0]
[null,null,null,null,null,null,null,null,null,null,null,null,null,null,null,null,null,null,null,null,null,null,0,0]
[null,null,null,null,null,null,null,null,null,null,null,null,null,null,null,null,null,null,null,null,null,null,0,0]
[null,null,null,null,null,null,null,null,null,null,null,null,null,null,null,null,null,null,null,null,null,null,0,0]
[null,null,null,null,null,null,null,null,null,null,null,null,null,null,null,null,null,null,null,null,null,null,0,0]
[null,null,null,null,null,null,null,null,null,null,null,null,null,null,null,null,null,null,null,null,null,null,0,0]
[null,null,null,null,null,null,null,null,null,null,null,null,null,null,null,null,null,null,null,null,null,null,0,0]
[null,null,null,null,null,null,null,null,null,null,null,null,null,null,null,null,null,null,null,null,null,null,0,0]
[null,null,null,null,null,null,null,null,null,null,null,null,null,null,null,null,null,null,null,null,null,null,0,0]
[null,null,null,null,null,null,null,null,null,null,null,null,null,null,null,null,null,null,null,null,null,null,0,0]
[null,null,null,null,null,null,null,null,null,null,null,null,null,null,null,null,null,null,null,null,null,null,0,0]
[null,null,null,null,null,null,null,null,null,null,null,null,null,null,null,null,null,null,null,null,null,null,0,0]
[null,null,null,null,null,null,null,null,null,null,null,null,null,null,null,null,null,null,null,null,null,null,0,0]
[null,null,null,null,null,null,null,null,null,null,null,null,null,null,null,null,null,null,null,null,null,null,0,0]
[null,null,null,null,null,null,null,null,null,null,null,null,null,null,null,null,null,null,null,null,null,null,0,0]
[null,null,null,null,null,null,null,null,null,null,null,null,null,null,null,null,null,null,null,null,null,null,0,0]
[null,null,null,null,null,null,null,null,null,null,null,null,null,null,null,null,null,null,null,null,null,null,0,0]
[null,null,null,null,null,null,null,null,null,null,null,null,null,null,null,null,null,null,null,null,null,null,0,0]
[null,null,null,null,null,null,null,null,null,null,null,null,null,null,null,null,null,null,null,null,null,null,0,0]
[null,null,null,null,null,null,null,null,null,null,null,null,null,null,null,null,null,null,null,null,null,null,0,0]
[null,null,null,null,null,null,null,null,null,null,null,null,null,null,null,null,null,null,null,null,null,null,0,0]
[null,null,null,null,null,null,null,null,null,null,null,null,null,null,null,null,null,null,null,null,null,null,0,0]
[null,null,null,null,null,null,null,null,null,null,null,null,null,null,null,null,null,null,null,null,null,null,0,0]
[null,null,null,null,null,null,null,null,null,null,null,null,null,null,null,null,null,null,null,null,null,null,0,0]
[null,null,null,null,null,null,null,null,null,null,null,null,null,null,null,null,null,null,null,null,null,null,0,0]
[null,null,null,null,null,null,null,null,null,null,null,null,null,null,null,null,null,null,null,null,null,null,0,0]
[null,null,null,null,null,null,null,null,null,null,null,null,null,null,null,null,null,null,null,null,null,null,0,0]
[null,null,null,null,null,null,null,null,null,null,null,null,null,null,null,null,null,null,null,null,null,null,0,0]
[null,null,null,null,null,null,null,null,null,null,null,null,null,null,null,null,null,null,null,null,null,null,0,0]
[null,null,null,null,null,null,null,null,null,null,null,null,null,null,null,null,null,null,null,null,null,null,0,0]
[null,null,null,null,null,null,null,null,null,null,null,null,null,null,null,null,null,null,null,null,null,null,0,0]
[null,null,null,null,null,null,null,null,null,null,null,null,null,null,null,null,null,null,null,null,null,null,0,0]
[null,null,null,null,null,null,null,null,null,null,null,null,null,null,null,null,null,null,null,null,null,null,0,0]
[null,null,null,null,null,null,null,null,null,null,null,null,null,null,null,null,null,null,null,null,null,null,0,0]
[null,null,null,null,null,null,null,null,null,null,null,null,null,null,null,null,null,null,null,null,null,null,0,0]
[null,null,null,null,null,null,null,null,null,null,null,null,null,null,null,null,null,null,null,null,null,null,0,0]
[null,null,null,null,null,null,null,null,null,null,null,null,null,null,null,null,null,null,null,null,null,null,0,0]
[null,null,null,null,null,null,null,null,null,null,null,null,null,null,null,null,null,null,null,null,null,null,0,0]
[null,null,null,null,null,null,null,null,null,null,null,null,null,null,null,null,null,null,null,null,null,null,0,0]
[null,null,null,null,null,null,null,null,null,null,null,null,null,null,null,null,null,null,null,null,null,null,0,0]
[null,null,null,null,null,null,null,null,null,null,null,null,null,null,null,null,null,null,null,null,null,null,0,0]
[null,null,null,null,null,null,null,null,null,null,null,null,null,null,null,null,null,null,null,null,null,null,0,0]
[null,null,null,null,null,null,null,null,null,null,null,null,null,null,null,null,null,null,null,null,null,null,0,0]
[null,null,null,null,null,null,null,null,null,null,null,null,null,null,null,null,null,null,null,null,null,null,0,0]
[null,null,null,null,null,null,null,null,null,null,null,null,null,null,null,null,null,null,null,null,null,null,0,0]
[null,null,null,null,null,null,null,null,null,null,null,null,null,null,null,null,null,null,null,null,null,null,0,0]
[null,null,null,null,null,null,null,null,null,null,null,null,null,null,null,null,null,null,null,null,null,null,0,0]
[null,null,null,null,null,null,null,null,null,null,null,null,null,null,null,null,null,null,null,null,null,null,0,0]