{"text_format":"1","workbook":"xlsx","n_sheets":10,"sheets":["Resumen","Kd","SWAP","Rf","Prima Mkdo US","Beta","Riesgo Pais","Riesgo Remuneracion","Tx","Inflacion"],"not_rendered":{"charts":0,"images":0,"macros":1,"external_links":0,"defined_names":43,"comments":1,"pivot_tables":0},"unopened":[],"bounds":{"document_bytes":16777216,"sheet_cells":100000,"rows_first":2000,"rows_last":500,"rows_between":2000,"halvings":0,"cell_chars":16384,"cell_head_chars":4096},"cells_cut":0,"cells_raw":0,"read":"whole","date_system":"1900"}

{"sheet":"Resumen","index":0,"n_rows":13,"n_cols":24,"rows_kept":13,"cut":false,"hidden":false,"merged":[[2,3,2,5],[5,3,5,5],[1,11,1,12],[1,15,2,16],[1,22,1,23]]}
[]
[null,null,null,"Fecha final",null,null,null,"Swap USD - COP",null,null,null,"Impuestos",null,null,null,"Estructura de Capital Regulatoria",null,null,null,null,null,null,"Inflación"]
[null,null,null,"2020-05-31",null,null,null,"SwapCOP",null,{"$f":"AVERAGE(SWAP!C4:C369)","v":5.5168076923076959E-2},null,"Año",2020,null,null,null,null,null,null,null,null,null,"PCOP",{"$f":"AVERAGE(Inflacion!S7:S257)","v":3.6032707794275864E-2}]
[null,null,null,null,null,null,null,"FDCOP",null,{"$f":"1/POWER(1+Swap_COP,10)","v":0.58449871964928679},null,"Tax",{"$f":"Tx","v":0.32},null,null,"Capital propio",0.6,null,null,null,null,null,"PUSD",{"$f":"AVERAGE(Inflacion!X7:X372)","v":1.5175841922189496E-2}]
[null,null,null,"Fecha inicial",null,null,null,"SwapUSD",null,{"$f":"AVERAGE(SWAP!D4:D369)","v":1.4712976923076923E-2},null,null,null,null,null,"Deuda",0.4]
[null,null,null,{"$f":"EOMONTH(D3,-12)+1","v":"2019-06-01"},null,null,null,"FDUSD",null,{"$f":"1/POWER(1+Swap_USD,10)","v":0.86410765999088346},null,"Rr","SISFV",null,null,"Tx",{"$f":"VLOOKUP(M3,Tx!B4:C6,2)","v":0.32},null,null,null,null,null,null,{"$f":"((1+Kd_COP)/(1+Inf_COP))-1","v":3.7227973073428622E-2}]
[]
[null,null,null,"Kd",null,"Rf",null,"RMH","RfH","RMkdo",null,"bU","bL",null,"CDS CO 10Y","CDS US 10Y","RPaís",null,"Rr",null,"Ke",null,"WACC","TD"]
[]
[null,"COP",null,{"$f":"SUMPRODUCT(Kd!B4:B55,Kd!C4:C55)/SUM(Kd!C4:C55)","v":7.4602105543232641E-2},null,null,null,null,null,null,null,null,null,null,null,null,null,null,null,null,{"$f":"((1+Ke_USD)*(1+Swap_COP)/(1+Swap_USD))-1","v":0.12088126933447807},null,{"$f":"(Deuda*Kd_COP)+(Equity*Ke_COP/(1-Tx))","v":0.1365007857477149},{"$f":"(WACC_COP-Inf_COP)/(1+Inf_COP)","v":9.6973847637818883E-2}]
[]
[null,"USD",null,{"$f":"((1+Kd_COP)*(1+Swap_USD)/(1+Swap_COP))-1","v":3.3401905697600487E-2},null,{"$f":"AVERAGE(Rf!C4:C369)","v":1.5240734615384615E-2},null,{"$f":"'Prima Mkdo US'!C108","v":0.11572285531911951},{"$f":"'Prima Mkdo US'!E108","v":5.1463635887600098E-2},{"$f":"'Prima Mkdo US'!H108","v":6.425921943151941E-2},null,{"$f":"Beta!B151","v":0.49292672783711894},{"$f":"Beta_U*(1+((1-Tx)*Deuda/Equity))","v":0.71638684445661283},null,{"$f":"AVERAGE('Riesgo Pais'!C4:C369)/10000","v":1.9036180384615395E-2},{"$f":"AVERAGE('Riesgo Pais'!D4:D369)/10000","v":2.4046461538461536E-3},{"$f":"O12-P12","v":1.663153423076924E-2},null,{"$f":"VLOOKUP(M6,'Riesgo Remuneracion'!B3:C3,2,FALSE)","v":0},null,{"$f":"F12+(PrimaMkdo*M12)+Q12+PrimaRemuneracion","v":7.7906728281945115E-2},null,{"$f":"(Deuda*Kd_USD)+(Equity*Ke_USD/(1-Tx))","v":8.2101993116050598E-2},{"$f":"(WACC_USD-Inf_USD)/(1+Inf_USD)","v":6.5925673592802866E-2}]
[null,null,null,{"$f":"(Kd_USD-Inf_USD)/(1+Inf_USD)","v":1.7953602738320452E-2},null,null,null,null,null,null,null,null,{"$f":"PrimaMkdo*M12","v":4.603445943579125E-2}]

{"sheet":"Kd","index":1,"n_rows":55,"n_cols":3,"rows_kept":55,"cut":false,"hidden":false,"merged":[]}
["Costo de deuda"]
[]
["Año - Semana","Tasa","Monto"]
[201923,8.6039533200000004E-2,896391.34413999994]
[201924,7.4577511299999996E-2,206628.75646999999]
[201925,7.4652178299999997E-2,267355.66901999997]
[201926,7.9525822400000001E-2,387397.73592000001]
[201927,8.2906343899999999E-2,48985.953500000003]
[201928,9.0178359499999999E-2,281608.84334999998]
[201929,7.8875971899999994E-2,188127.68356999999]
[201930,8.0979142599999998E-2,301924.70009]
[201931,5.2908821100000003E-2,258074.19407999999]
[201932,8.8839840500000003E-2,126493.26515000001]
[201933,9.6597884100000003E-2,210364.14217000001]
[201934,7.1940294900000007E-2,222462.58517999999]
[201935,7.3451093300000006E-2,250738.27677999999]
[201936,8.3991383700000005E-2,74190.011180000001]
[201937,8.0864644799999996E-2,257851.06847]
[201938,7.5496108100000001E-2,329807.73626999999]
[201939,7.2252243499999994E-2,336254.69738000003]
{"$rows_left_out":36}
{"sheet":"SWAP","index":2,"n_rows":369,"n_cols":4,"rows_kept":369,"cut":false,"hidden":false,"merged":[]}
[null,"Tasas equivalentes"]
[]
[null,"Fecha","CLSWU10  Curncy","USSWAP10 Curncy"]
[null,43617,null,""]
[null,43618]
[null,43619,5.9299999999999999E-2,2.027E-2]
[null,43620,5.8499999999999996E-2,2.1021999999999999E-2]
[null,43621,5.8600000000000006E-2,2.1172E-2]
[null,43622,5.7999999999999996E-2,2.1107999999999998E-2]
[null,43623,5.7699999999999994E-2,2.0749E-2]
[null,43624]
[null,43625]
[null,43626,5.6799999999999996E-2,2.1278000000000002E-2]
[null,43627,5.6500000000000002E-2,2.1135999999999999E-2]
[null,43628,5.6600000000000004E-2,2.0804999999999997E-2]
[null,43629,5.5500000000000001E-2,2.0390000000000002E-2]
[null,43630,5.5199999999999999E-2,2.0114999999999997E-2]
[null,43631]
[null,43632]
[null,43633,5.6500000000000002E-2,2.0415000000000003E-2]
{"$rows_left_out":350}
{"sheet":"Rf","index":3,"n_rows":369,"n_cols":3,"rows_kept":369,"cut":false,"hidden":false,"merged":[]}
[null,"Tasa libre de riesgo"]
[]
[null,"Fecha","USGG10YR Index"]
[null,43617,""]
[null,43618]
[null,43619,2.0710000000000003E-2]
[null,43620,2.1295999999999999E-2]
[null,43621,2.1347999999999999E-2]
[null,43622,2.1173999999999998E-2]
[null,43623,2.0809000000000001E-2]
[null,43624]
[null,43625]
[null,43626,2.1484E-2]
[null,43627,2.1430999999999999E-2]
[null,43628,2.1204999999999998E-2]
[null,43629,2.0945000000000002E-2]
[null,43630,2.0804E-2]
[null,43631]
[null,43632]
[null,43633,2.0941999999999999E-2]
{"$rows_left_out":350}
{"sheet":"Prima Mkdo US","index":4,"n_rows":115,"n_cols":11,"rows_kept":115,"cut":false,"hidden":false,"merged":[[105,6,105,7],[105,8,105,9]]}
[null,"Updated on","2019-01-01"]
[null,"Customixed Geometric risk premium estimator"]
[null,"What is your riskfree rate?",null,"LT",null,null,"Estimates of risk premiums from 1928, over the last 40 years and over the last 10 years"]
[null,"Enter your starting year",null,1981,null,null,"are provided at the bottom of this table."]
[]
[null,"Value of stocks in starting year:",null,null,null,{"$f":"IF(D4=1928,100,VLOOKUP(D4-1,B13:H98,5))","v":7934.2637789341807}]
[null,"Value of T.Bills in starting year:",null,null,null,{"$f":"IF(D4=1928,100,VLOOKUP(D4-1,B13:H98,6))","v":453.46389244561374},null,"http://www.stern.nyu.edu/~adamodar/pc/datasets/histretSP.xls"]
[null,"Value of T.bonds in starting year:",null,null,null,{"$f":"IF(D4=1928,100,VLOOKUP(D4-1,B12:H98,7))","v":448.16699336164055}]
[null,"Estimate of risk premium based on your inputs:",null,null,null,{"$f":"IF(D3=\"ST\",(F104/F6)^(1/(B104-D4+1))-(G104/F7)^(1/(B104-D4+1)),(F104/F6)^(1/(B104-D4+1))-(H104/F8)^(1/(B104-D4+1)))","v":3.6713988822697052E-2}]
[]
[null,null,"Annual Returns on Investments in",null,null,"Compounded Value of $ 100"]
[null,"Year","S&P 500","3-month T.Bill","10-year T. Bond","Stocks","T.Bills","T.Bonds","Stocks - Bills","Stocks - Bonds","Historical risk premium"]
[null,1928,0.43811155152887893,3.0800000000000001E-2,8.354708589799302E-3,{"$f":"100*(1+C13)","v":143.81115515288789},{"$f":"100*(1+D13)","v":103.08},{"$f":"100*(1+E13)","v":100.83547085897993},{"$f":"C13-D13","v":0.40731155152887893},{"$f":"C13-E13","v":0.42975684293907962}]
[null,1929,-8.2979466119096595E-2,3.1600000000000003E-2,4.2038041563204259E-2,{"$f":"F13*(1+C14)","v":131.87778227633069},106.337328,105.074396573995,{"$f":"C14-D14","v":-0.1145794661190966},{"$f":"C14-E14","v":-0.12501750768230085}]
[null,1930,-0.25123636363636365,4.5499999999999999E-2,4.5409314348970366E-2,98.745287812797272,111.17567642400002,109.84575287805193,-0.29673636363636363,-0.29664567798533403]
[null,1931,-0.43837548891786188,2.3099999999999999E-2,-2.5588559619422531E-2,55.457773989527276,113.74383454939441,107.03495828159154,-0.46147548891786189,-0.41278692929843935]
[null,1932,-8.642364532019696E-2,1.0699999999999999E-2,8.7903069904773257E-2,50.664911000008722,114.96089357907292,116.44365970167279,-9.7123645320196961E-2,-0.17432671522497023]
[null,1933,0.49982225433526023,9.5999999999999992E-3,1.8552720891857361E-2,75.988361031728402,116.06451815743202,118.60400641974435,0.49022225433526023,0.48126953344340284]
[null,1934,-1.1885656970912803E-2,2.7833333333333334E-3,7.9634426179656104E-2,75.085189438723404,116.38756439963687,128.04896841358894,-1.4668990304246137E-2,-9.1520083150568907E-2]
[null,1935,0.46740421052631581,1.6750000000000001E-3,4.4720477296566127E-2,110.18032313054879,116.58251357000627,133.77537939837757,0.46572921052631583,0.42268373322974967]
{"$rows_left_out":96}
{"sheet":"Beta","index":5,"n_rows":151,"n_cols":37,"rows_kept":151,"cut":false,"hidden":false,"merged":[]}
[]
["EMPRESAS CANASTA","ABLE US Equity","AEE US Equity","AEP US Equity","AES US Equity","AGR US Equity","ALE US Equity","ATO US Equity","AWR US Equity","BDCO US Equity","CMNR US Equity","CNIG US Equity","CNP US Equity","CPK US Equity","D US Equity","ED US Equity","EPD US Equity","EPSN US Equity","ES US Equity","ESOA US Equity","MDU US Equity","MGEE US Equity","NFG US Equity","NI US Equity","NJR US Equity","NWN US Equity","OGS US Equity","PPL US Equity","PSTRQ US Equity","RGCO US Equity","SJI US Equity","SO US Equity","SR US Equity","SRE US Equity","SWX US Equity","TIDE US Equity","UTL US Equity"]
[]
[]
[]
["BETAS INDIVIDUALES"]
[]
["2019-05-31",8758.3134804717101,0.68430381243295835,0.55238159069371706,1.0255711874789639,0.64308542016549863,0.79793466161851101,0.67263528623380819,0.74434460920867773,0.51495227442823943,-22.376195229821267,0.17085390451102722,0.99256981285253931,0.8013669116101052,0.70283596121715752,0.50705349281520995,0.97937163207765177,0.29887728161364135,0.67336695572059579,0.25677133825287657,0.96418418944492368,0.84566508205630742,0.72649474310437745,0.74193284093397982,0.92293798594963139,0.85241748979141108,0.85300103747270439,0.78788390372554729,-0.61236302063254933,0.49902685545164122,0.86318362854599961,0.69186046010303948,0.74060384788167577,0.77110463392973772,0.84204274126728573,51.001602521801296,0.76955960764030062]
[]
["CUR_MKT_CAP",{"$f":"B2","v":"ABLE US Equity"},{"$f":"C2","v":"AEE US Equity"},"AEP US Equity","AES US Equity","AGR US Equity","ALE US Equity","ATO US Equity","AWR US Equity","BDCO US Equity","CMNR US Equity","CNIG US Equity","CNP US Equity","CPK US Equity","D US Equity","ED US Equity","EPD US Equity","EPSN US Equity","ES US Equity","ESOA US Equity","MDU US Equity","MGEE US Equity","NFG US Equity","NI US Equity","NJR US Equity","NWN US Equity","OGS US Equity","PPL US Equity","PSTRQ US Equity","RGCO US Equity","SJI US Equity","SO US Equity","SR US Equity","SRE US Equity","SWX US Equity","TIDE US Equity","UTL US Equity"]
["2015-06-30",null,9142.4791000000005,25952.225399999999,9049.1697999999997,"",2261.5639999999999,5180.2435999999998,1412.5935999999999,50.157299999999999,3.0800000000000001E-2,47.568600000000004,8186.8392000000003,819.90300000000002,39685.520600000003,16951.728599999999,59524.610500000003,131.10939999999999,14424.375400000001,17.799800000000001,3803.8766999999998,1342.7058999999999,4971.4886999999999,14469.254199999999,2357.7627000000002,1152.8920000000001,2238.3897999999999,19689.120299999999,17.7347,94.570499999999996,1692.1241,38056.150699999998,2255.1835999999998,24495.574400000001,2492.5030000000002,2.7199999999999998E-2,461.18049999999999]
["2015-07-31",1.9E-3,9967.4374000000007,27750.958299999998,8735.2469000000001,null,2354.1911,5586.3392000000003,1456.4184,51.724699999999999,3.0800000000000001E-2,46.372700000000002,8320.2034000000003,782.90459999999996,42551.993799999997,18624.057100000002,56640.073600000003,115.2591,15793.436299999999,17.087800000000001,3799.9812000000002,1375.6409000000001,4564.5847999999996,5541.4165000000003,2473.2973000000002,1183.2312999999999,2348.1923000000002,21311.737000000001,14.103300000000001,95.847200000000001,1658.5963999999999,40626.530299999999,2343.9874,25198.7019,2639.1208000000001,2.7199999999999998E-2,496.81630000000001]
["2015-08-31",1.9E-3,9775.7559000000001,26632.482400000001,8193.9220999999998,null,2334.0752000000002,5554.0456999999997,1405.8356000000001,43.383299999999998,3.0800000000000001E-2,40.985100000000003,8011.4732000000004,751.88350000000003,41453.952499999999,18424.570400000001,56308.811399999999,108.1236,14983.259899999999,15.5214,3493.5918000000001,1333.3454999999999,4563.2111000000004,5336.8548000000001,2417.2413999999999,1203.4177999999999,2240.7689,20762.361799999999,8.1603999999999992,98.129900000000006,1651.8806,39434.720800000003,2293.5012999999999,23482.9719,2592.3865000000001,2.7199999999999998E-2,503.2448]
["2015-09-30",1.9E-3,10256.1728,27893.220600000001,6684.8747999999996,null,2466.4598999999998,5897.6890000000003,1541.7639999999999,45.473999999999997,0,39.15,7761.9214000000002,810.02589999999998,41828.3753,19578.485700000001,49878.669699999999,101.7804,16055.305200000001,17.087800000000001,3355.0965000000001,1427.9901,4226.6361999999999,5896.2869000000001,2567.7311,1254.3126999999999,2363.8364000000001,22035.3043,2.6981999999999999,95.5749,1730.7048,40606.588799999998,2362.3843999999999,23978.405999999999,2744.3815,2.7199999999999998E-2,515.40319999999997]
["2015-10-31",1.9E-3,10598.287899999999,27804.806499999999,7476.9539000000004,null,2452.7818000000002,6386.2909,1517.5576000000001,41.815199999999997,3.8E-3,40.985100000000003,7981.3549000000003,796.74929999999995,42452.4133,19256.3266,55347.294900000001,96.7209,16156.8006,17.087800000000001,3678.9023000000002,1430.7636,4442.2808999999997,6090.1809000000003,2708.8152,1307.123,2547.2334000000001,23046.958600000002,2.7972999999999999,98.413799999999995,1817.0686000000001,40969.958700000003,2537.4079000000002,25389.046300000002,2892.1415000000002,2.7199999999999998E-2,495.99130000000002]
["2015-11-30",1.9E-3,10617.698700000001,27490.683300000001,6721.8932000000004,null,2494.7953000000002,6324.8791000000001,1536.3425999999999,52.582599999999999,3.8E-3,40.960599999999999,7292.9439000000002,813.64009999999996,40107.625899999999,18221.899000000001,50926.088600000003,91.734399999999994,16160.894399999999,14.667,3401.5293000000001,1507.0340000000001,3869.4663,6115.3022000000001,2578.1759000000002,1335.7361000000001,2542.5394999999999,22903.6636,2.4238,101.3946,1591.0005000000001,40484.138800000001,2529.9299999999998,24629.922900000001,2656.8121999999998,2.7199999999999998E-2,491.23700000000002]
["2015-12-31",1.4999999999999999E-2,10489.102199999999,28599.930700000001,6439.2911000000004,11908.300800000001,2488.9195,6433.3110999999999,1540.75,52.268999999999998,3.8E-3,40.649000000000001,7899.6135999999997,866.46799999999996,40268.365899999997,18843.4666,51307.181799999998,79.973500000000001,16198.9573,17.9422,3577.2685000000001,1608.6123,3618.1033000000002,6217.277,2827.6570000000002,1385.2788,2616.5990999999999,22964.219700000001,1.9358,101.2362,1629.8054,42529.251300000004,2575.4479000000001,23334.264299999999,2613.2269000000001,2.0000000000000001E-4,501.72449999999998]
["2016-01-31",1.4999999999999999E-2,10899.155000000001,29925.137699999999,6392.1907000000001,11923.806399999999,2590.2782000000002,7063.9877999999999,1667.4625000000001,49.6556,3.0800000000000001E-2,39.417200000000001,7688.7851000000001,961.43589999999995,42965.227200000001,20344.611000000001,47957.578800000003,87.872500000000002,17064.8894,17.087800000000001,3296.0857999999998,1679.6824999999999,3841.4394000000002,6695.2839000000004,3021.5437000000002,1421.9567999999999,2949.8672999999999,23589.966100000001,1.9651999999999998,100.7137,1722.66,44465.2912,2771.8252000000002,23517.9401,2787.0945999999999,2.0000000000000001E-4,542.22170000000006]
["2016-02-29",1.9E-3,11391.7037,30322.496899999998,6465.3867,12029.244500000001,2603.9103,7087.2395999999999,1548.9480000000001,49.131599999999999,3.0800000000000001E-2,38.6205,8015.9629000000004,951.71450000000004,41701.638299999999,20554.192899999998,47236.914900000003,102.80500000000001,17223.485100000002,23.3643,3555.7892999999999,1682.8026,3873.2208000000001,6868.0529999999999,2974.6720999999998,1368.7773,3031.8989999999999,23624.904600000002,1.6705000000000001,102.09099999999999,1810.2771,43980.967700000001,2845.1707000000001,23954.790499999999,2894.8452000000002,2.7199999999999998E-2,550.33749999999998]
["2016-03-31",1.9E-3,12156.0033,32607.3727,7784.8534,12438.5923,2760.4349000000002,7589.9916000000003,1437.5523000000001,49.6556,3.8E-3,39.394399999999997,9008.4637000000002,961.94960000000003,44826.113100000002,22494.818800000001,49763.493600000002,118.5385,18505.858199999999,21.5564,3800.6233000000002,1811.4223,4243.7543999999998,7533.1158999999998,3130.1936999999998,1477.4235000000001,3195.0504999999998,25726.764500000001,1.2446999999999999,102.7564,2026.5193999999999,47260.934000000001,2943.4315999999999,25939.678,3125.5275999999999,2.7199999999999998E-2,596.41290000000004]
{"$rows_left_out":132}
{"sheet":"Riesgo Pais","index":6,"n_rows":369,"n_cols":4,"rows_kept":369,"cut":false,"hidden":false,"merged":[]}
[null,"Riesgo país"]
[]
[null,"Fechas","COLOM CDS USD SR 10Y CBIN Corp","US CDS EUR SR 10Y Corp"]
[null,43617,""]
[null,43618]
[null,43619,193.61,23.875]
[null,43620,190.809,23.785]
[null,43621,189.994,23.62]
[null,43622,189.839,24.02]
[null,43623,189.02500000000001,26.39]
[null,43624]
[null,43625]
[null,43626,186.178,26.31]
[null,43627,183.48699999999999,26.885000000000002]
[null,43628,184.75399999999999,26.63]
[null,43629,185.24799999999999,25.824999999999999]
[null,43630,186.21899999999999,25.824999999999999]
[null,43631]
[null,43632]
[null,43633,186.696,24.605]
{"$rows_left_out":350}
{"sheet":"Riesgo Remuneracion","index":7,"n_rows":3,"n_cols":3,"rows_kept":3,"cut":false,"hidden":false,"merged":[]}
[]
[null,"Sector","Rr"]
[null,"SISFV",0]

{"sheet":"Tx","index":8,"n_rows":6,"n_cols":3,"rows_kept":6,"cut":false,"hidden":false,"merged":[[1,1,1,2]]}
[]
[null,"Tasa de impuestos"]
[null,"Año","Tx"]
[null,2020,0.32]
[null,2021,0.31]
[null,2022,0.3]

{"sheet":"Inflacion","index":9,"n_rows":372,"n_cols":24,"rows_kept":372,"cut":false,"hidden":false,"merged":[]}
[null,"Inflación"]
[]
[null,"Dias",3650]
[]
[null,null,"CEC COP",null,null,null,null,"CEC UVR",null,null,null,null,"Yield COP",null,null,"Yield UVR"]
[null,"FECHA","bO","b1","b2","t",null,"bO","b1","b2","t",null,"COP CONT","COP DISC",null,"UVR CONT","UVR DISC ",null,"BEI COP",null,"Fecha","USGG10YR Index","USGGT10YR Index","BEI USD"]
[null,"2019-06-01",8.6416550000000001,-4.6461600000000001,2.02E-4,5.3646099999999999,null,4.3305110000000004,-3.413837,-0.107306,3.2449050000000002,null,{"$f":"(C7+((D7+E7)*((1-EXP((-$C$3/365)/F7))/(($C$3/365)/F7)))-(E7*EXP((-$C$3/365)/F7)))/100","v":6.5356677099216207E-2},{"$f":"EXP(M7)-1","v":6.7539723458697187E-2},null,{"$f":"(H7+((I7+J7)*((1-EXP((-$C$3/365)/K7))/(($C$3/365)/K7)))-(J7*EXP((-$C$3/365)/K7)))/100","v":3.2452765754574023E-2},{"$f":"EXP(P7)-1","v":3.2985099719899935E-2},null,{"$f":"((1+N7)/(1+Q7))-1","v":3.3451231530994052E-2},null,43617,"",""]
[null,"2019-06-02",8.6416550000000001,-4.6461600000000001,2.02E-4,5.3646099999999999,null,4.3305110000000004,-3.413837,-0.107306,3.2449050000000002,null,{"$f":"(C8+((D8+E8)*((1-EXP((-$C$3/365)/F8))/(($C$3/365)/F8)))-(E8*EXP((-$C$3/365)/F8)))/100","v":6.5356677099216207E-2},{"$f":"EXP(M8)-1","v":6.7539723458697187E-2},null,{"$f":"(H8+((I8+J8)*((1-EXP((-$C$3/365)/K8))/(($C$3/365)/K8)))-(J8*EXP((-$C$3/365)/K8)))/100","v":3.2452765754574023E-2},{"$f":"EXP(P8)-1","v":3.2985099719899935E-2},null,3.3451231530994052E-2,null,43618]
[null,"2019-06-03",8.6416550000000001,-4.6461600000000001,2.02E-4,5.3646099999999999,null,4.3305110000000004,-3.413837,-0.107306,3.2449050000000002,null,6.5356677099216207E-2,6.7539723458697187E-2,null,3.2452765754574023E-2,3.2985099719899935E-2,null,3.3451231530994052E-2,null,43619,2.0710000000000002,0.33850000000000002,{"$f":"((1+V9/100)/(1+W9/100))-1","v":1.7266552719046091E-2}]
[null,"2019-06-04",8.5976649999999992,-4.6515870000000001,2.0000000000000001E-4,5.4182560000000004,null,4.3345890000000002,-3.4126120000000002,-0.13708699999999999,3.2559179999999999,null,6.4754108970557195E-2,6.6896651811960473E-2,null,3.2387714414706059E-2,3.2917904840681578E-2,null,3.2895883411489413E-2,null,43620,2.1295999999999999,0.37140000000000001,1.7516942077125508E-2]
[null,"2019-06-05",8.5481459999999991,-4.6050890000000004,2.3E-5,5.5681929999999999,null,4.300764,-3.3884470000000002,-0.13722500000000001,3.2591739999999998,null,6.4095453522346801E-2,6.6194165893052492E-2,null,3.2115016766250587E-2,3.2636268959450598E-2,null,3.2497306110908619E-2,null,43621,2.1347999999999998,0.3705,1.7577873976915459E-2]
[null,"2019-06-06",8.5310810000000004,-4.5590440000000001,-2.5000000000000001E-5,5.7118630000000001,null,4.2958569999999998,-3.3575390000000001,-0.16087099999999999,3.2694559999999999,null,6.3791926793973622E-2,6.587059657452099E-2,null,3.2070928044100465E-2,3.2590742349518642E-2,null,3.2229471813081112E-2,null,43622,2.1173999999999999,0.3639,1.7471421497171846E-2]
[null,"2019-06-07",8.5111139999999992,-4.5277370000000001,-4.3999999999999999E-5,5.8571859999999996,null,4.3061239999999996,-3.354371,-0.170323,3.3785400000000001,null,6.3400681777002962E-2,6.5453661582063116E-2,null,3.1858355980366168E-2,3.237126573254967E-2,null,3.2045056800412697E-2,null,43623,2.0809000000000002,0.33119999999999999,1.7439241233036196E-2]
[null,"2019-06-08",8.5111139999999992,-4.5277370000000001,-4.3999999999999999E-5,5.8571859999999996,null,4.3061239999999996,-3.354371,-0.170323,3.3785400000000001,null,6.3400681777002962E-2,6.5453661582063116E-2,null,3.1858355980366168E-2,3.237126573254967E-2,null,3.2045056800412697E-2,null,43624]
[null,"2019-06-09",8.5111139999999992,-4.5277370000000001,-4.3999999999999999E-5,5.8571859999999996,null,4.3061239999999996,-3.354371,-0.170323,3.3785400000000001,null,6.3400681777002962E-2,6.5453661582063116E-2,null,3.1858355980366168E-2,3.237126573254967E-2,null,3.2045056800412697E-2,null,43625]
[null,"2019-06-10",8.4564990000000009,-4.5032259999999997,-8.8999999999999995E-5,5.9157609999999998,null,4.3267730000000002,-3.379108,-0.24127100000000001,3.4358209999999998,null,6.2838353894359461E-2,6.485469570388136E-2,null,3.1637397597605171E-2,3.2143179846936709E-2,null,3.1692808222397728E-2,null,43626,2.1484000000000001,0.40789999999999998,1.7334293417151647E-2]
[null,"2019-06-11",8.4177330000000001,-4.5048469999999998,-2.63E-4,5.9749189999999999,null,4.3310579999999996,-3.3694579999999998,-0.28571800000000003,3.51031,null,6.2308801461125982E-2,6.4290948588733521E-2,null,3.138837363380223E-2,3.1886183461536266E-2,null,3.140342960935194E-2,null,43627,2.1431,0.41830000000000001,1.7176152155533364E-2]
[null,"2019-06-12",8.4616530000000001,-4.5650820000000003,-2.6600000000000001E-4,6.0346679999999999,null,4.3717959999999998,-3.388646,-0.50016000000000005,3.5558160000000001,null,6.232033049879674E-2,6.4303218909904869E-2,null,3.1021112457016119E-2,3.1507281309772983E-2,null,3.1794189138915963E-2,null,43628,2.1204999999999998,0.41249999999999998,1.700983443296411E-2]
[null,"2019-06-13",8.4205469999999991,-4.51952,-1.735E-3,6.3512079999999997,null,4.3374280000000001,-3.342171,-0.70515600000000001,3.5663109999999998,null,6.144089487615749E-2,6.3367644195070127E-2,null,3.0241554020146326E-2,3.0703474453850133E-2,null,3.1691141585147076E-2,null,43629,2.0945,0.4083,1.6793432415447729E-2]
[null,"2019-06-14",8.3553289999999993,-4.4302919999999997,-3.9690000000000003E-3,6.4148139999999998,null,4.3450670000000002,-3.3397230000000002,-0.84365199999999996,3.624139,null,6.1100620659729994E-2,6.3005869158016647E-2,null,2.9784156280890751E-2,3.0232140816479625E-2,null,3.1811983962724444E-2,null,43630,2.0804,0.43480000000000002,1.6384759067574306E-2]
{"$rows_left_out":352}